BDBM50410670 CHEMBL199446
SMILES: Cn1c2cc([nH]c2c(=O)n(C)c1=O)-c1ccc(OCC(=O)Nc2ccc(F)cc2)cc1
InChI Key: InChIKey=OTTHALQEWXGENA-UHFFFAOYSA-N
Data: 3 KI  4 Kd
Activity Spreadsheet -- Enzyme Inhibition Constant Data from BindingDB
Found 7 hits for monomerid = 50410670
Trg + Lig
Ki
nM
ΔG°
kcal/mole
IC50
nM
Kd
nM
EC50/IC50
nM
koff
s-1
kon
M-1s-1
pHTemp
°C
Adenosine receptor A2b
(Homo sapiens (Human))
BDBM50410670
(CHEMBL199446)
Show SMILES Cn1c2cc([nH]c2c(=O)n(C)c1=O)-c1ccc(OCC(=O)Nc2ccc(F)cc2)cc1
Show InChI InChI=1S/C22H19FN4O4/c1-26-18-11-17(25-20(18)21(29)27(2)22(26)30)13-3-9-16(10-4-13)31-12-19(28)24-15-7-5-14(23)6-8-15/h3-11,25H,12H2,1-2H3,(H,24,28)
NCI pathway
Reactome pathway
3.02n/an/an/an/an/an/an/an/a
Universit£ di Bari
Curated by ChEMBL
Assay Description
Binding affinity to recombinant human adenosine A2B receptor
J Med Chem 49: 282-99 (2006)
Article DOI: 10.1021/jm0506221
BindingDB Entry DOI: 10.7270/Q29K4CF5
Adenosine receptor A1
(Homo sapiens (Human))
BDBM50410670
(CHEMBL199446)
Show SMILES Cn1c2cc([nH]c2c(=O)n(C)c1=O)-c1ccc(OCC(=O)Nc2ccc(F)cc2)cc1
Show InChI InChI=1S/C22H19FN4O4/c1-26-18-11-17(25-20(18)21(29)27(2)22(26)30)13-3-9-16(10-4-13)31-12-19(28)24-15-7-5-14(23)6-8-15/h3-11,25H,12H2,1-2H3,(H,24,28)
Reactome pathway
14.8n/an/an/an/an/an/an/an/a
Universit£ di Bari
Curated by ChEMBL
Assay Description
Binding affinity to recombinant human adenosine A1 receptor
J Med Chem 49: 282-99 (2006)
Article DOI: 10.1021/jm0506221
BindingDB Entry DOI: 10.7270/Q29K4CF5
Adenosine receptor A2a
(Homo sapiens (Human))
BDBM50410670
(CHEMBL199446)
Show SMILES Cn1c2cc([nH]c2c(=O)n(C)c1=O)-c1ccc(OCC(=O)Nc2ccc(F)cc2)cc1
Show InChI InChI=1S/C22H19FN4O4/c1-26-18-11-17(25-20(18)21(29)27(2)22(26)30)13-3-9-16(10-4-13)31-12-19(28)24-15-7-5-14(23)6-8-15/h3-11,25H,12H2,1-2H3,(H,24,28)
NCI pathway
Reactome pathway
64.6n/an/an/an/an/an/an/an/a
Universit£ di Bari
Curated by ChEMBL
Assay Description
Binding affinity to recombinant human adenosine A2A receptor
J Med Chem 49: 282-99 (2006)
Article DOI: 10.1021/jm0506221
BindingDB Entry DOI: 10.7270/Q29K4CF5
Adenosine receptor A2a
(Homo sapiens (Human))
BDBM50410670
(CHEMBL199446)
Show SMILES Cn1c2cc([nH]c2c(=O)n(C)c1=O)-c1ccc(OCC(=O)Nc2ccc(F)cc2)cc1
Show InChI InChI=1S/C22H19FN4O4/c1-26-18-11-17(25-20(18)21(29)27(2)22(26)30)13-3-9-16(10-4-13)31-12-19(28)24-15-7-5-14(23)6-8-15/h3-11,25H,12H2,1-2H3,(H,24,28)
NCI pathway
Reactome pathway
n/an/an/a 57.5n/an/an/an/an/a
Universit£ di Bari
Curated by ChEMBL
Assay Description
Antagonist potency at cloned recombinant human adenosine A2A receptor transfected in CHO cells by cAMP assay
J Med Chem 49: 282-99 (2006)
Article DOI: 10.1021/jm0506221
BindingDB Entry DOI: 10.7270/Q29K4CF5
Adenosine Receptors A2a (A2a)
(Rattus norvegicus (rat))
BDBM50410670
(CHEMBL199446)
Show SMILES Cn1c2cc([nH]c2c(=O)n(C)c1=O)-c1ccc(OCC(=O)Nc2ccc(F)cc2)cc1
Show InChI InChI=1S/C22H19FN4O4/c1-26-18-11-17(25-20(18)21(29)27(2)22(26)30)13-3-9-16(10-4-13)31-12-19(28)24-15-7-5-14(23)6-8-15/h3-11,25H,12H2,1-2H3,(H,24,28)
Reactome pathway
n/an/an/a 51.3n/an/an/an/an/a
Universit£ di Bari
Curated by ChEMBL
Assay Description
Antagonist potency against adenosine A2A receptor of Sprague-Dawley rat aortic smooth muscle
J Med Chem 49: 282-99 (2006)
Article DOI: 10.1021/jm0506221
BindingDB Entry DOI: 10.7270/Q29K4CF5
Adenosine receptor A2b
(Homo sapiens (Human))
BDBM50410670
(CHEMBL199446)
Show SMILES Cn1c2cc([nH]c2c(=O)n(C)c1=O)-c1ccc(OCC(=O)Nc2ccc(F)cc2)cc1
Show InChI InChI=1S/C22H19FN4O4/c1-26-18-11-17(25-20(18)21(29)27(2)22(26)30)13-3-9-16(10-4-13)31-12-19(28)24-15-7-5-14(23)6-8-15/h3-11,25H,12H2,1-2H3,(H,24,28)
NCI pathway
Reactome pathway
n/an/an/a 5.62n/an/an/an/an/a
Universit£ di Bari
Curated by ChEMBL
Assay Description
Antagonist potency against adenosine A2B receptor of guinea pig thoracic aortic smooth muscle
J Med Chem 49: 282-99 (2006)
Article DOI: 10.1021/jm0506221
BindingDB Entry DOI: 10.7270/Q29K4CF5
Adenosine receptor A2b
(Homo sapiens (Human))
BDBM50410670
(CHEMBL199446)
Show SMILES Cn1c2cc([nH]c2c(=O)n(C)c1=O)-c1ccc(OCC(=O)Nc2ccc(F)cc2)cc1
Show InChI InChI=1S/C22H19FN4O4/c1-26-18-11-17(25-20(18)21(29)27(2)22(26)30)13-3-9-16(10-4-13)31-12-19(28)24-15-7-5-14(23)6-8-15/h3-11,25H,12H2,1-2H3,(H,24,28)
NCI pathway
Reactome pathway
n/an/an/a 3.98n/an/an/an/an/a
Universit£ di Bari
Curated by ChEMBL
Assay Description
Antagonist potency at cloned recombinant human adenosine A2B receptor transfected in CHO cells by cAMP assay
J Med Chem 49: 282-99 (2006)
Article DOI: 10.1021/jm0506221
BindingDB Entry DOI: 10.7270/Q29K4CF5