BDBM50410847 CHEMBL205455
SMILES: CC(C)(C)C(=O)CN1c2ccccc2C(=NN(CC(=O)Nc2cccc(c2)C(O)=O)C1=O)C1CCCCC1
InChI Key: InChIKey=FYFOJUSNDFLZLR-UHFFFAOYSA-N
Data: 3 KI  1 Kd
Activity Spreadsheet -- Enzyme Inhibition Constant Data from BindingDB
Found 4 hits for monomerid = 50410847
Trg + Lig
Ki
nM
ΔG°
kcal/mole
IC50
nM
Kd
nM
EC50/IC50
nM
koff
s-1
kon
M-1s-1
pHTemp
°C
Cholecystokinin receptor
(Homo sapiens (Human))
BDBM50410847
(CHEMBL205455)
Show SMILES CC(C)(C)C(=O)CN1c2ccccc2C(=NN(CC(=O)Nc2cccc(c2)C(O)=O)C1=O)C1CCCCC1 |c:15|
Show InChI InChI=1S/C29H34N4O5/c1-29(2,3)24(34)17-32-23-15-8-7-14-22(23)26(19-10-5-4-6-11-19)31-33(28(32)38)18-25(35)30-21-13-9-12-20(16-21)27(36)37/h7-9,12-16,19H,4-6,10-11,17-18H2,1-3H3,(H,30,35)(H,36,37)
Reactome pathway
5.10n/an/an/an/an/an/an/an/a
James Black Foundation
Curated by ChEMBL
Assay Description
Displacement of [3H]BH-CCK-8S from human recombinant CCK2 receptor expressed in NIH3T3 cells
J Med Chem 50: 3101-12 (2007)
Checked by Author
Article DOI: 10.1021/jm070139l
BindingDB Entry DOI: 10.7270/Q2QJ7JHN
Cholecystokinin B receptor
(Dog)
BDBM50410847
(CHEMBL205455)
Show SMILES CC(C)(C)C(=O)CN1c2ccccc2C(=NN(CC(=O)Nc2cccc(c2)C(O)=O)C1=O)C1CCCCC1 |c:15|
Show InChI InChI=1S/C29H34N4O5/c1-29(2,3)24(34)17-32-23-15-8-7-14-22(23)26(19-10-5-4-6-11-19)31-33(28(32)38)18-25(35)30-21-13-9-12-20(16-21)27(36)37/h7-9,12-16,19H,4-6,10-11,17-18H2,1-3H3,(H,30,35)(H,36,37)
12n/an/an/an/an/an/an/an/a
James Black Foundation
Curated by ChEMBL
Assay Description
Displacement of [125I]BH-CCK8-8S from CCK2 receptor in canine gastric mucosa
J Med Chem 50: 3101-12 (2007)
Checked by Author
Article DOI: 10.1021/jm070139l
BindingDB Entry DOI: 10.7270/Q2QJ7JHN
Cholecystokinin receptor
(Homo sapiens (Human))
BDBM50410847
(CHEMBL205455)
Show SMILES CC(C)(C)C(=O)CN1c2ccccc2C(=NN(CC(=O)Nc2cccc(c2)C(O)=O)C1=O)C1CCCCC1 |c:15|
Show InChI InChI=1S/C29H34N4O5/c1-29(2,3)24(34)17-32-23-15-8-7-14-22(23)26(19-10-5-4-6-11-19)31-33(28(32)38)18-25(35)30-21-13-9-12-20(16-21)27(36)37/h7-9,12-16,19H,4-6,10-11,17-18H2,1-3H3,(H,30,35)(H,36,37)
Reactome pathway
<1.00E+4n/an/an/an/an/an/an/an/a
James Black Foundation
Curated by ChEMBL
Assay Description
Displacement of [3H]L-364718 from human recombinant CCK1 receptor expressed in PC3 cells
J Med Chem 50: 3101-12 (2007)
Checked by Author
Article DOI: 10.1021/jm070139l
BindingDB Entry DOI: 10.7270/Q2QJ7JHN
CCKBR
(RAT)
BDBM50410847
(CHEMBL205455)
Show SMILES CC(C)(C)C(=O)CN1c2ccccc2C(=NN(CC(=O)Nc2cccc(c2)C(O)=O)C1=O)C1CCCCC1 |c:15|
Show InChI InChI=1S/C29H34N4O5/c1-29(2,3)24(34)17-32-23-15-8-7-14-22(23)26(19-10-5-4-6-11-19)31-33(28(32)38)18-25(35)30-21-13-9-12-20(16-21)27(36)37/h7-9,12-16,19H,4-6,10-11,17-18H2,1-3H3,(H,30,35)(H,36,37)
n/an/an/a 0.977n/an/an/an/an/a
James Black Foundation
Curated by ChEMBL
Assay Description
Affinity for CCK2 receptor assessed by inhibition of pentagastrin-stimulated acid secretion in perfused rat stomach
J Med Chem 49: 2253-61 (2006)
Article DOI: 10.1021/jm051219x
BindingDB Entry DOI: 10.7270/Q28K7B8B