null
SMILES: CCC[C@@H]([C@@H](CC(C)C)C(=O)N[C@H]1CCCCN(Cc2cccc(NN3CCCCC3)c2)C1=O)C(N)=O
InChI Key: InChIKey=DWCYHFXPVUXQIQ-NXCFDTQHSA-N
Activity Spreadsheet -- Enzyme Inhibition Constant Data from BindingDB
Found 1 hit for monomerid = 50410863
Trg + Lig
Ki
nM
ΔG°
kcal/mole
IC50
nM
Kd
nM
EC50/IC50
nM
koff
s-1
kon
M-1s-1
pHTemp
°C
Amyloid-beta precursor protein
(Homo sapiens (Human))
BDBM50410863
(CHEMBL208230)
Show SMILES CCC[C@@H]([C@@H](CC(C)C)C(=O)N[C@H]1CCCCN(Cc2cccc(NN3CCCCC3)c2)C1=O)C(N)=O
Show InChI InChI=1S/C29H47N5O3/c1-4-11-24(27(30)35)25(18-21(2)3)28(36)31-26-14-6-9-15-33(29(26)37)20-22-12-10-13-23(19-22)32-34-16-7-5-8-17-34/h10,12-13,19,21,24-26,32H,4-9,11,14-18,20H2,1-3H3,(H2,30,35)(H,31,36)/t24-,25+,26-/m0/s1
Reactome pathway
n/an/a 74n/an/an/an/an/an/a
Bristol-Myers Squibb Pharmaceutical Research Institute
Curated by ChEMBL
Assay Description
Inhibition of beta-amyloid peptide production in CHO N9 cell line
Bioorg Med Chem Lett 16: 2357-63 (2006)
Article DOI: 10.1016/j.bmcl.2006.01.055
BindingDB Entry DOI: 10.7270/Q2WD405K