BDBM50411030 CHEMBL210077
SMILES: CCC1(CC(O)(C(=O)Nc2ccc3c(c2)c(C)noc3=O)C(F)(F)F)CCCc2ccccc12
InChI Key: InChIKey=QNVMARIKSCEIAR-UHFFFAOYSA-N
Data: 6 IC50  2 EC50
Activity Spreadsheet -- Enzyme Inhibition Constant Data from BindingDB
Found 8 hits for monomerid = 50411030
Trg + Lig
Ki
nM
ΔG°
kcal/mole
IC50
nM
Kd
nM
EC50/IC50
nM
koff
s-1
kon
M-1s-1
pHTemp
°C
Glucocorticoid receptor
(Homo sapiens (Human))
BDBM50411030
(CHEMBL210077)
Show SMILES CCC1(CC(O)(C(=O)Nc2ccc3c(c2)c(C)noc3=O)C(F)(F)F)CCCc2ccccc12
Show InChI InChI=1S/C25H25F3N2O4/c1-3-23(12-6-8-16-7-4-5-9-20(16)23)14-24(33,25(26,27)28)22(32)29-17-10-11-18-19(13-17)15(2)30-34-21(18)31/h4-5,7,9-11,13,33H,3,6,8,12,14H2,1-2H3,(H,29,32)
n/an/an/an/a 9.10n/an/an/an/a
GlaxoSmithKline Medicines Research Centre
Curated by ChEMBL
Assay Description
Agonist activity at GR assessed as MMTV-mediated transactivation of renilla luciferase gene in human A549 cells relative to Dexamethasone
J Med Chem 49: 4216-31 (2006)
Checked by Author
Article DOI: 10.1021/jm060302x
BindingDB Entry DOI: 10.7270/Q2BC40SB
Glucocorticoid receptor
(Homo sapiens (Human))
BDBM50411030
(CHEMBL210077)
Show SMILES CCC1(CC(O)(C(=O)Nc2ccc3c(c2)c(C)noc3=O)C(F)(F)F)CCCc2ccccc12
Show InChI InChI=1S/C25H25F3N2O4/c1-3-23(12-6-8-16-7-4-5-9-20(16)23)14-24(33,25(26,27)28)22(32)29-17-10-11-18-19(13-17)15(2)30-34-21(18)31/h4-5,7,9-11,13,33H,3,6,8,12,14H2,1-2H3,(H,29,32)
n/an/a 5n/an/an/an/an/an/a
GlaxoSmithKline Medicines Research Centre
Curated by ChEMBL
Assay Description
Agonist activity at GR assessed as NF-kappaB-mediated transrepression of secreted placental alkaline phosphatase gene in human A549 cells
J Med Chem 49: 4216-31 (2006)
Checked by Author
Article DOI: 10.1021/jm060302x
BindingDB Entry DOI: 10.7270/Q2BC40SB
Glucocorticoid receptor
(Homo sapiens (Human))
BDBM50411030
(CHEMBL210077)
Show SMILES CCC1(CC(O)(C(=O)Nc2ccc3c(c2)c(C)noc3=O)C(F)(F)F)CCCc2ccccc12
Show InChI InChI=1S/C25H25F3N2O4/c1-3-23(12-6-8-16-7-4-5-9-20(16)23)14-24(33,25(26,27)28)22(32)29-17-10-11-18-19(13-17)15(2)30-34-21(18)31/h4-5,7,9-11,13,33H,3,6,8,12,14H2,1-2H3,(H,29,32)
n/an/a 200n/an/an/an/an/an/a
GlaxoSmithKline Medicines Research Centre
Curated by ChEMBL
Assay Description
Activity at GR assessed as ability to antagonize dexamethasone-induced MMTV luciferase reporter gene transactivation in human A549 cells
J Med Chem 49: 4216-31 (2006)
Checked by Author
Article DOI: 10.1021/jm060302x
BindingDB Entry DOI: 10.7270/Q2BC40SB
Glucocorticoid receptor
(Homo sapiens (Human))
BDBM50411030
(CHEMBL210077)
Show SMILES CCC1(CC(O)(C(=O)Nc2ccc3c(c2)c(C)noc3=O)C(F)(F)F)CCCc2ccccc12
Show InChI InChI=1S/C25H25F3N2O4/c1-3-23(12-6-8-16-7-4-5-9-20(16)23)14-24(33,25(26,27)28)22(32)29-17-10-11-18-19(13-17)15(2)30-34-21(18)31/h4-5,7,9-11,13,33H,3,6,8,12,14H2,1-2H3,(H,29,32)
n/an/a 200n/an/an/an/an/an/a
GlaxoSmithKline Medicines Research Centre
Curated by ChEMBL
Assay Description
Antagonist activity at glucocorticoid receptor in human A549 cells transfected with MMTV luciferase reporter gene assessed as inhibition of dexametha...
J Med Chem 50: 6519-34 (2007)
Article DOI: 10.1021/jm070778w
BindingDB Entry DOI: 10.7270/Q21R6RRR
Glucocorticoid receptor
(Homo sapiens (Human))
BDBM50411030
(CHEMBL210077)
Show SMILES CCC1(CC(O)(C(=O)Nc2ccc3c(c2)c(C)noc3=O)C(F)(F)F)CCCc2ccccc12
Show InChI InChI=1S/C25H25F3N2O4/c1-3-23(12-6-8-16-7-4-5-9-20(16)23)14-24(33,25(26,27)28)22(32)29-17-10-11-18-19(13-17)15(2)30-34-21(18)31/h4-5,7,9-11,13,33H,3,6,8,12,14H2,1-2H3,(H,29,32)
n/an/a 5.01n/an/an/an/an/an/a
GlaxoSmithKline Medicines Research Centre
Curated by ChEMBL
Assay Description
Agonist activity at glucocorticoid receptor in human A549 cells by NF-kappaB transrepression assay
J Med Chem 50: 6519-34 (2007)
Article DOI: 10.1021/jm070778w
BindingDB Entry DOI: 10.7270/Q21R6RRR
Glucocorticoid receptor
(Homo sapiens (Human))
BDBM50411030
(CHEMBL210077)
Show SMILES CCC1(CC(O)(C(=O)Nc2ccc3c(c2)c(C)noc3=O)C(F)(F)F)CCCc2ccccc12
Show InChI InChI=1S/C25H25F3N2O4/c1-3-23(12-6-8-16-7-4-5-9-20(16)23)14-24(33,25(26,27)28)22(32)29-17-10-11-18-19(13-17)15(2)30-34-21(18)31/h4-5,7,9-11,13,33H,3,6,8,12,14H2,1-2H3,(H,29,32)
n/an/a 6.17n/an/an/an/an/an/a
GlaxoSmithKline Medicines Research Centre
Curated by ChEMBL
Assay Description
Displacement of fluorescent labeled Dexamethasone from glucocorticoid receptor
J Med Chem 50: 6519-34 (2007)
Article DOI: 10.1021/jm070778w
BindingDB Entry DOI: 10.7270/Q21R6RRR
Glucocorticoid receptor
(Homo sapiens (Human))
BDBM50411030
(CHEMBL210077)
Show SMILES CCC1(CC(O)(C(=O)Nc2ccc3c(c2)c(C)noc3=O)C(F)(F)F)CCCc2ccccc12
Show InChI InChI=1S/C25H25F3N2O4/c1-3-23(12-6-8-16-7-4-5-9-20(16)23)14-24(33,25(26,27)28)22(32)29-17-10-11-18-19(13-17)15(2)30-34-21(18)31/h4-5,7,9-11,13,33H,3,6,8,12,14H2,1-2H3,(H,29,32)
n/an/an/an/a 9.12n/an/an/an/a
GlaxoSmithKline Medicines Research Centre
Curated by ChEMBL
Assay Description
Agonist activity at glucocorticoid receptor in human A549 cells by MMTV transactivation assay
J Med Chem 50: 6519-34 (2007)
Article DOI: 10.1021/jm070778w
BindingDB Entry DOI: 10.7270/Q21R6RRR
Glucocorticoid receptor
(Homo sapiens (Human))
BDBM50411030
(CHEMBL210077)
Show SMILES CCC1(CC(O)(C(=O)Nc2ccc3c(c2)c(C)noc3=O)C(F)(F)F)CCCc2ccccc12
Show InChI InChI=1S/C25H25F3N2O4/c1-3-23(12-6-8-16-7-4-5-9-20(16)23)14-24(33,25(26,27)28)22(32)29-17-10-11-18-19(13-17)15(2)30-34-21(18)31/h4-5,7,9-11,13,33H,3,6,8,12,14H2,1-2H3,(H,29,32)
n/an/a 6.20n/an/an/an/an/an/a
GlaxoSmithKline Medicines Research Centre
Curated by ChEMBL
Assay Description
Inhibition of fluorescent-labeled Dexamethasone binding to GR
J Med Chem 49: 4216-31 (2006)
Checked by Author
Article DOI: 10.1021/jm060302x
BindingDB Entry DOI: 10.7270/Q2BC40SB