BDBM50411040 CHEMBL209574
SMILES: Cc1noc(=O)c2ccc(NC(=O)C(O)(CC3CCCc4ccc(cc34)[N+]([O-])=O)C(F)(F)F)cc12
InChI Key: InChIKey=BGMFAXNBXUEDNN-UHFFFAOYSA-N
Data: 2 IC50
Activity Spreadsheet -- Enzyme Inhibition Constant Data from BindingDB
Found 2 hits for monomerid = 50411040
Trg + Lig
Ki
nM
ΔG°
kcal/mole
IC50
nM
Kd
nM
EC50/IC50
nM
koff
s-1
kon
M-1s-1
pHTemp
°C
Glucocorticoid receptor
(Homo sapiens (Human))
BDBM50411040
(CHEMBL209574)
Show SMILES Cc1noc(=O)c2ccc(NC(=O)C(O)(CC3CCCc4ccc(cc34)[N+]([O-])=O)C(F)(F)F)cc12
Show InChI InChI=1S/C23H20F3N3O6/c1-12-18-9-15(6-8-17(18)20(30)35-28-12)27-21(31)22(32,23(24,25)26)11-14-4-2-3-13-5-7-16(29(33)34)10-19(13)14/h5-10,14,32H,2-4,11H2,1H3,(H,27,31)
n/an/a<1.00E+3n/an/an/an/an/an/a
GlaxoSmithKline Medicines Research Centre
Curated by ChEMBL
Assay Description
Agonist activity at GR assessed as NF-kappaB-mediated transrepression of secreted placental alkaline phosphatase gene in human A549 cells
J Med Chem 49: 4216-31 (2006)
Checked by Author
Article DOI: 10.1021/jm060302x
BindingDB Entry DOI: 10.7270/Q2BC40SB
Glucocorticoid receptor
(Homo sapiens (Human))
BDBM50411040
(CHEMBL209574)
Show SMILES Cc1noc(=O)c2ccc(NC(=O)C(O)(CC3CCCc4ccc(cc34)[N+]([O-])=O)C(F)(F)F)cc12
Show InChI InChI=1S/C23H20F3N3O6/c1-12-18-9-15(6-8-17(18)20(30)35-28-12)27-21(31)22(32,23(24,25)26)11-14-4-2-3-13-5-7-16(29(33)34)10-19(13)14/h5-10,14,32H,2-4,11H2,1H3,(H,27,31)
n/an/a 20n/an/an/an/an/an/a
GlaxoSmithKline Medicines Research Centre
Curated by ChEMBL
Assay Description
Inhibition of fluorescent-labeled Dexamethasone binding to GR
J Med Chem 49: 4216-31 (2006)
Checked by Author
Article DOI: 10.1021/jm060302x
BindingDB Entry DOI: 10.7270/Q2BC40SB