BDBM50411218 CHEMBL479613
SMILES: C1N[C@@H]2CN(CC[C@H]12)c1cccnc1
InChI Key: InChIKey=FDOUKQXLQIXJFX-MWLCHTKSSA-N
Data: 3 EC50
Activity Spreadsheet -- Enzyme Inhibition Constant Data from BindingDB
Found 3 hits for monomerid = 50411218
Trg + Lig
Ki
nM
ΔG°
kcal/mole
IC50
nM
Kd
nM
EC50/IC50
nM
koff
s-1
kon
M-1s-1
pHTemp
°C
Neuronal acetylcholine receptor Alpha-4/Beta-2
(Homo sapiens (Human))
BDBM50411218
(CHEMBL479613)
Show SMILES C1N[C@@H]2CN(CC[C@H]12)c1cccnc1 |r|
Show InChI InChI=1S/C11H15N3/c1-2-10(7-12-4-1)14-5-3-9-6-13-11(9)8-14/h1-2,4,7,9,11,13H,3,5-6,8H2/t9-,11-/m1/s1
NCI pathway
Reactome pathway
n/an/an/an/a 330n/an/an/an/a
Abbott Laboratories
Curated by ChEMBL
Assay Description
Agonist activity at human alpha4beta2 ACHR expressed in HEK293 cells assessed as change in intracellular calcium concentration by FLIPR
J Med Chem 49: 7843-53 (2006)
Article DOI: 10.1021/jm060846z
BindingDB Entry DOI: 10.7270/Q28G8MZZ
Cholinergic, Nicotinic Alpha3Beta2
(Homo sapiens (Human))
BDBM50411218
(CHEMBL479613)
Show SMILES C1N[C@@H]2CN(CC[C@H]12)c1cccnc1 |r|
Show InChI InChI=1S/C11H15N3/c1-2-10(7-12-4-1)14-5-3-9-6-13-11(9)8-14/h1-2,4,7,9,11,13H,3,5-6,8H2/t9-,11-/m1/s1
n/an/an/an/a 257n/an/an/an/a
Burnham Institute for Medical Research
Curated by ChEMBL
Assay Description
Agonist activity against human alpha3beta4 nAChR
Bioorg Med Chem Lett 19: 127-31 (2008)
Article DOI: 10.1016/j.bmcl.2008.11.016
BindingDB Entry DOI: 10.7270/Q2T154WM
Neuronal acetylcholine receptor subunit alpha-4
(Homo sapiens (Human))
BDBM50411218
(CHEMBL479613)
Show SMILES C1N[C@@H]2CN(CC[C@H]12)c1cccnc1 |r|
Show InChI InChI=1S/C11H15N3/c1-2-10(7-12-4-1)14-5-3-9-6-13-11(9)8-14/h1-2,4,7,9,11,13H,3,5-6,8H2/t9-,11-/m1/s1
n/an/an/an/a 331n/an/an/an/a
Burnham Institute for Medical Research
Curated by ChEMBL
Assay Description
Agonist activity against human alpha4beta2 nAChR
Bioorg Med Chem Lett 19: 127-31 (2008)
Article DOI: 10.1016/j.bmcl.2008.11.016
BindingDB Entry DOI: 10.7270/Q2T154WM