BDBM50411222 CHEMBL508645
SMILES: C1[C@H]2CCNC[C@H]2N1c1cccnc1
InChI Key: InChIKey=NHOKDBHEVHBXTJ-MWLCHTKSSA-N
Data: 3 EC50
Activity Spreadsheet -- Enzyme Inhibition Constant Data from BindingDB
Found 3 hits for monomerid = 50411222
Trg + Lig
Ki
nM
ΔG°
kcal/mole
IC50
nM
Kd
nM
EC50/IC50
nM
koff
s-1
kon
M-1s-1
pHTemp
°C
Neuronal acetylcholine receptor subunit alpha-4
(Homo sapiens (Human))
BDBM50411222
(CHEMBL508645)
Show SMILES C1[C@H]2CCNC[C@H]2N1c1cccnc1 |r|
Show InChI InChI=1S/C11H15N3/c1-2-10(6-12-4-1)14-8-9-3-5-13-7-11(9)14/h1-2,4,6,9,11,13H,3,5,7-8H2/t9-,11-/m1/s1
n/an/an/an/a 1.41E+3n/an/an/an/a
Burnham Institute for Medical Research
Curated by ChEMBL
Assay Description
Agonist activity against human alpha4beta2 nAChR
Bioorg Med Chem Lett 19: 127-31 (2008)
Article DOI: 10.1016/j.bmcl.2008.11.016
BindingDB Entry DOI: 10.7270/Q2T154WM
Cholinergic, Nicotinic Alpha3Beta2
(Homo sapiens (Human))
BDBM50411222
(CHEMBL508645)
Show SMILES C1[C@H]2CCNC[C@H]2N1c1cccnc1 |r|
Show InChI InChI=1S/C11H15N3/c1-2-10(6-12-4-1)14-8-9-3-5-13-7-11(9)14/h1-2,4,6,9,11,13H,3,5,7-8H2/t9-,11-/m1/s1
n/an/an/an/a 1.55E+3n/an/an/an/a
Burnham Institute for Medical Research
Curated by ChEMBL
Assay Description
Agonist activity against human alpha3beta4 nAChR
Bioorg Med Chem Lett 19: 127-31 (2008)
Article DOI: 10.1016/j.bmcl.2008.11.016
BindingDB Entry DOI: 10.7270/Q2T154WM
Neuronal acetylcholine receptor Alpha-4/Beta-2
(Homo sapiens (Human))
BDBM50411222
(CHEMBL508645)
Show SMILES C1[C@H]2CCNC[C@H]2N1c1cccnc1 |r|
Show InChI InChI=1S/C11H15N3/c1-2-10(6-12-4-1)14-8-9-3-5-13-7-11(9)14/h1-2,4,6,9,11,13H,3,5,7-8H2/t9-,11-/m1/s1
NCI pathway
Reactome pathway
n/an/an/an/a 1.40E+3n/an/an/an/a
Abbott Laboratories
Curated by ChEMBL
Assay Description
Agonist activity at human alpha4beta2 ACHR expressed in HEK293 cells assessed as change in intracellular calcium concentration by FLIPR
J Med Chem 49: 7843-53 (2006)
Article DOI: 10.1021/jm060846z
BindingDB Entry DOI: 10.7270/Q28G8MZZ