BDBM50411362 CHEMBL437744
SMILES: [#6]-[#6@@H](-[#8])-[#6@H](-[#7]-[#6](=O)-[#6@H](-[#6]-c1ccc(F)cc1)-[#7]-[#6](=O)-[#6]-[#7]-[#6](=O)-[#6](-[#6]-[#7])-[#7]-[#6](=O)-[#6@@H](-[#7])-[#6]-c1ccccc1)-[#6](=O)-[#7]-[#6]-[#6](=O)-[#7]C([#6])([#6])[#6](=O)-[#7]-[#6@@H](-[#6]-[#6]-[#6]\[#7]=[#6](/[#7])-[#7])-[#6](=O)-[#7]-[#6@@H](-[#6]-[#6]-[#6]-[#6]-[#7])-[#6](=O)-[#7]-[#6@@H](-[#6]-[#8])-[#6](=O)-[#7]-[#6@@H](-[#6])-[#6](=O)-[#7]-[#6@@H](-[#6]-[#6]-[#6]\[#7]=[#6](/[#7])-[#7])-[#6](=O)-[#7]-[#6@@H](-[#6]-[#6]-[#6]-[#6]-[#7])-[#6](=O)-[#7]-[#6@@H](-[#6]-[#6]-[#6]\[#7]=[#6](\[#7])-[#7])-[#6](=O)-[#7]-[#6@@H](-[#6]-[#6]-[#6]-[#6]-[#7])-[#6](=O)-[#7]-[#6@@H](-[#6]-[#6](-[#7])=O)-[#6](=O)-[#7]-[#6@@H](-[#6]-[#6]-[#6](-[#7])=O)-[#6](-[#7])=O
InChI Key: InChIKey=QHICZDNNQPJVJF-GZSOHMJMSA-N
Data: 3 Kd
Activity Spreadsheet -- Enzyme Inhibition Constant Data from BindingDB
Found 3 hits for monomerid = 50411362
Trg + Lig
Ki
nM
ΔG°
kcal/mole
IC50
nM
Kd
nM
EC50/IC50
nM
koff
s-1
kon
M-1s-1
pHTemp
°C
Nociceptin receptor
(Cavia porcellus)
BDBM50411362
(CHEMBL437744)
Show SMILES [#6]-[#6@@H](-[#8])-[#6@H](-[#7]-[#6](=O)-[#6@H](-[#6]-c1ccc(F)cc1)-[#7]-[#6](=O)-[#6]-[#7]-[#6](=O)-[#6](-[#6]-[#7])-[#7]-[#6](=O)-[#6@@H](-[#7])-[#6]-c1ccccc1)-[#6](=O)-[#7]-[#6]-[#6](=O)-[#7]C([#6])([#6])[#6](=O)-[#7]-[#6@@H](-[#6]-[#6]-[#6]\[#7]=[#6](/[#7])-[#7])-[#6](=O)-[#7]-[#6@@H](-[#6]-[#6]-[#6]-[#6]-[#7])-[#6](=O)-[#7]-[#6@@H](-[#6]-[#8])-[#6](=O)-[#7]-[#6@@H](-[#6])-[#6](=O)-[#7]-[#6@@H](-[#6]-[#6]-[#6]\[#7]=[#6](/[#7])-[#7])-[#6](=O)-[#7]-[#6@@H](-[#6]-[#6]-[#6]-[#6]-[#7])-[#6](=O)-[#7]-[#6@@H](-[#6]-[#6]-[#6]\[#7]=[#6](\[#7])-[#7])-[#6](=O)-[#7]-[#6@@H](-[#6]-[#6]-[#6]-[#6]-[#7])-[#6](=O)-[#7]-[#6@@H](-[#6]-[#6](-[#7])=O)-[#6](=O)-[#7]-[#6@@H](-[#6]-[#6]-[#6](-[#7])=O)-[#6](-[#7])=O
Show InChI InChI=1S/C84H142FN33O21/c1-44(67(126)108-54(22-14-34-100-81(94)95)71(130)109-51(19-8-11-31-86)70(129)112-55(23-15-35-101-82(96)97)72(131)110-52(20-9-12-32-87)73(132)113-58(39-62(92)122)76(135)107-50(66(93)125)29-30-61(91)121)105-78(137)60(43-119)115-74(133)53(21-10-13-33-88)111-75(134)56(24-16-36-102-83(98)99)116-80(139)84(3,4)118-64(124)42-104-79(138)65(45(2)120)117-77(136)57(38-47-25-27-48(85)28-26-47)106-63(123)41-103-69(128)59(40-89)114-68(127)49(90)37-46-17-6-5-7-18-46/h5-7,17-18,25-28,44-45,49-60,65,119-120H,8-16,19-24,29-43,86-90H2,1-4H3,(H2,91,121)(H2,92,122)(H2,93,125)(H,103,128)(H,104,138)(H,105,137)(H,106,123)(H,107,135)(H,108,126)(H,109,130)(H,110,131)(H,111,134)(H,112,129)(H,113,132)(H,114,127)(H,115,133)(H,116,139)(H,117,136)(H,118,124)(H4,94,95,100)(H4,96,97,101)(H4,98,99,102)/t44-,45+,49-,50-,51-,52-,53-,54-,55-,56-,57-,58-,59?,60-,65-/m0/s1
n/an/an/a 0.316n/an/an/an/an/a
University of Ferrara
Curated by ChEMBL
Assay Description
Antagonist activity at NOP receptor in Albino guinea pig ileum assessed as effect on electrically stimulated contractions
Bioorg Med Chem 15: 4434-43 (2007)
Article DOI: 10.1016/j.bmc.2007.04.026
BindingDB Entry DOI: 10.7270/Q22R3SVP
Nociceptin/Orphanin FQ, NOP receptor
(MOUSE)
BDBM50411362
(CHEMBL437744)
Show SMILES [#6]-[#6@@H](-[#8])-[#6@H](-[#7]-[#6](=O)-[#6@H](-[#6]-c1ccc(F)cc1)-[#7]-[#6](=O)-[#6]-[#7]-[#6](=O)-[#6](-[#6]-[#7])-[#7]-[#6](=O)-[#6@@H](-[#7])-[#6]-c1ccccc1)-[#6](=O)-[#7]-[#6]-[#6](=O)-[#7]C([#6])([#6])[#6](=O)-[#7]-[#6@@H](-[#6]-[#6]-[#6]\[#7]=[#6](/[#7])-[#7])-[#6](=O)-[#7]-[#6@@H](-[#6]-[#6]-[#6]-[#6]-[#7])-[#6](=O)-[#7]-[#6@@H](-[#6]-[#8])-[#6](=O)-[#7]-[#6@@H](-[#6])-[#6](=O)-[#7]-[#6@@H](-[#6]-[#6]-[#6]\[#7]=[#6](/[#7])-[#7])-[#6](=O)-[#7]-[#6@@H](-[#6]-[#6]-[#6]-[#6]-[#7])-[#6](=O)-[#7]-[#6@@H](-[#6]-[#6]-[#6]\[#7]=[#6](\[#7])-[#7])-[#6](=O)-[#7]-[#6@@H](-[#6]-[#6]-[#6]-[#6]-[#7])-[#6](=O)-[#7]-[#6@@H](-[#6]-[#6](-[#7])=O)-[#6](=O)-[#7]-[#6@@H](-[#6]-[#6]-[#6](-[#7])=O)-[#6](-[#7])=O
Show InChI InChI=1S/C84H142FN33O21/c1-44(67(126)108-54(22-14-34-100-81(94)95)71(130)109-51(19-8-11-31-86)70(129)112-55(23-15-35-101-82(96)97)72(131)110-52(20-9-12-32-87)73(132)113-58(39-62(92)122)76(135)107-50(66(93)125)29-30-61(91)121)105-78(137)60(43-119)115-74(133)53(21-10-13-33-88)111-75(134)56(24-16-36-102-83(98)99)116-80(139)84(3,4)118-64(124)42-104-79(138)65(45(2)120)117-77(136)57(38-47-25-27-48(85)28-26-47)106-63(123)41-103-69(128)59(40-89)114-68(127)49(90)37-46-17-6-5-7-18-46/h5-7,17-18,25-28,44-45,49-60,65,119-120H,8-16,19-24,29-43,86-90H2,1-4H3,(H2,91,121)(H2,92,122)(H2,93,125)(H,103,128)(H,104,138)(H,105,137)(H,106,123)(H,107,135)(H,108,126)(H,109,130)(H,110,131)(H,111,134)(H,112,129)(H,113,132)(H,114,127)(H,115,133)(H,116,139)(H,117,136)(H,118,124)(H4,94,95,100)(H4,96,97,101)(H4,98,99,102)/t44-,45+,49-,50-,51-,52-,53-,54-,55-,56-,57-,58-,59?,60-,65-/m0/s1
n/an/an/a 0.794n/an/an/an/an/a
University of Ferrara
Curated by ChEMBL
Assay Description
Antagonist activity at NOP receptor in Swiss mouse vas deferens by [35S]GTP-gamma-S binding assay
Bioorg Med Chem 15: 4434-43 (2007)
Article DOI: 10.1016/j.bmc.2007.04.026
BindingDB Entry DOI: 10.7270/Q22R3SVP
Nociceptin/Orphanin FQ, NOP receptor
(RAT)
BDBM50411362
(CHEMBL437744)
Show SMILES [#6]-[#6@@H](-[#8])-[#6@H](-[#7]-[#6](=O)-[#6@H](-[#6]-c1ccc(F)cc1)-[#7]-[#6](=O)-[#6]-[#7]-[#6](=O)-[#6](-[#6]-[#7])-[#7]-[#6](=O)-[#6@@H](-[#7])-[#6]-c1ccccc1)-[#6](=O)-[#7]-[#6]-[#6](=O)-[#7]C([#6])([#6])[#6](=O)-[#7]-[#6@@H](-[#6]-[#6]-[#6]\[#7]=[#6](/[#7])-[#7])-[#6](=O)-[#7]-[#6@@H](-[#6]-[#6]-[#6]-[#6]-[#7])-[#6](=O)-[#7]-[#6@@H](-[#6]-[#8])-[#6](=O)-[#7]-[#6@@H](-[#6])-[#6](=O)-[#7]-[#6@@H](-[#6]-[#6]-[#6]\[#7]=[#6](/[#7])-[#7])-[#6](=O)-[#7]-[#6@@H](-[#6]-[#6]-[#6]-[#6]-[#7])-[#6](=O)-[#7]-[#6@@H](-[#6]-[#6]-[#6]\[#7]=[#6](\[#7])-[#7])-[#6](=O)-[#7]-[#6@@H](-[#6]-[#6]-[#6]-[#6]-[#7])-[#6](=O)-[#7]-[#6@@H](-[#6]-[#6](-[#7])=O)-[#6](=O)-[#7]-[#6@@H](-[#6]-[#6]-[#6](-[#7])=O)-[#6](-[#7])=O
Show InChI InChI=1S/C84H142FN33O21/c1-44(67(126)108-54(22-14-34-100-81(94)95)71(130)109-51(19-8-11-31-86)70(129)112-55(23-15-35-101-82(96)97)72(131)110-52(20-9-12-32-87)73(132)113-58(39-62(92)122)76(135)107-50(66(93)125)29-30-61(91)121)105-78(137)60(43-119)115-74(133)53(21-10-13-33-88)111-75(134)56(24-16-36-102-83(98)99)116-80(139)84(3,4)118-64(124)42-104-79(138)65(45(2)120)117-77(136)57(38-47-25-27-48(85)28-26-47)106-63(123)41-103-69(128)59(40-89)114-68(127)49(90)37-46-17-6-5-7-18-46/h5-7,17-18,25-28,44-45,49-60,65,119-120H,8-16,19-24,29-43,86-90H2,1-4H3,(H2,91,121)(H2,92,122)(H2,93,125)(H,103,128)(H,104,138)(H,105,137)(H,106,123)(H,107,135)(H,108,126)(H,109,130)(H,110,131)(H,111,134)(H,112,129)(H,113,132)(H,114,127)(H,115,133)(H,116,139)(H,117,136)(H,118,124)(H4,94,95,100)(H4,96,97,101)(H4,98,99,102)/t44-,45+,49-,50-,51-,52-,53-,54-,55-,56-,57-,58-,59?,60-,65-/m0/s1
Reactome pathway
n/an/an/a 0.603n/an/an/an/an/a
University of Ferrara
Curated by ChEMBL
Assay Description
Antagonist activity at NOP receptor in Sprague-Dawley rat vas deferens assessed as effect on electrically stimulated contractions
Bioorg Med Chem 15: 4434-43 (2007)
Article DOI: 10.1016/j.bmc.2007.04.026
BindingDB Entry DOI: 10.7270/Q22R3SVP