BDBM50411410 CHEMBL398601
SMILES: O=C(Nc1sc2CN(CCc2c1C#N)S(=O)(=O)c1ccccc1)c1cccc2ccccc12
InChI Key: InChIKey=HEOQTGAUGMPJQO-UHFFFAOYSA-N
Data: 4 IC50
Activity Spreadsheet -- Enzyme Inhibition Constant Data from BindingDB
Found 4 hits for monomerid = 50411410
Trg + Lig
Ki
nM
ΔG°
kcal/mole
IC50
nM
Kd
nM
EC50/IC50
nM
koff
s-1
kon
M-1s-1
pHTemp
°C
Mitogen-activated protein kinase 1
(Homo sapiens (Human))
BDBM50411410
(CHEMBL398601)
Show SMILES O=C(Nc1sc2CN(CCc2c1C#N)S(=O)(=O)c1ccccc1)c1cccc2ccccc12
Show InChI InChI=1S/C25H19N3O3S2/c26-15-22-20-13-14-28(33(30,31)18-9-2-1-3-10-18)16-23(20)32-25(22)27-24(29)21-12-6-8-17-7-4-5-11-19(17)21/h1-12H,13-14,16H2,(H,27,29)
NCI pathway
Reactome pathway
n/an/a>1.00E+4n/an/an/an/an/an/a
GlaxoSmithKline R&D
Curated by ChEMBL
Assay Description
Inhibition of human recombinant full length ERK2
Bioorg Med Chem Lett 17: 1296-301 (2007)
Article DOI: 10.1016/j.bmcl.2006.12.003
BindingDB Entry DOI: 10.7270/Q2TB1840
Mitogen-activated protein kinase 14
(Homo sapiens (Human))
BDBM50411410
(CHEMBL398601)
Show SMILES O=C(Nc1sc2CN(CCc2c1C#N)S(=O)(=O)c1ccccc1)c1cccc2ccccc12
Show InChI InChI=1S/C25H19N3O3S2/c26-15-22-20-13-14-28(33(30,31)18-9-2-1-3-10-18)16-23(20)32-25(22)27-24(29)21-12-6-8-17-7-4-5-11-19(17)21/h1-12H,13-14,16H2,(H,27,29)
NCI pathway
Reactome pathway
n/an/a>1.58E+4n/an/an/an/an/an/a
GlaxoSmithKline R&D
Curated by ChEMBL
Assay Description
Inhibition of mitogen-activated protein kinase p38alpha
Bioorg Med Chem Lett 17: 1296-301 (2007)
Article DOI: 10.1016/j.bmcl.2006.12.003
BindingDB Entry DOI: 10.7270/Q2TB1840
Mitogen-activated protein kinase 10
(Homo sapiens (Human))
BDBM50411410
(CHEMBL398601)
Show SMILES O=C(Nc1sc2CN(CCc2c1C#N)S(=O)(=O)c1ccccc1)c1cccc2ccccc12
Show InChI InChI=1S/C25H19N3O3S2/c26-15-22-20-13-14-28(33(30,31)18-9-2-1-3-10-18)16-23(20)32-25(22)27-24(29)21-12-6-8-17-7-4-5-11-19(17)21/h1-12H,13-14,16H2,(H,27,29)
NCI pathway
Reactome pathway
n/an/a 3.16E+3n/an/an/an/an/an/a
GlaxoSmithKline R&D
Curated by ChEMBL
Assay Description
Inhibition of human truncated JNK3
Bioorg Med Chem Lett 17: 1296-301 (2007)
Article DOI: 10.1016/j.bmcl.2006.12.003
BindingDB Entry DOI: 10.7270/Q2TB1840
Mitogen-activated protein kinase 8
(Homo sapiens (Human))
BDBM50411410
(CHEMBL398601)
Show SMILES O=C(Nc1sc2CN(CCc2c1C#N)S(=O)(=O)c1ccccc1)c1cccc2ccccc12
Show InChI InChI=1S/C25H19N3O3S2/c26-15-22-20-13-14-28(33(30,31)18-9-2-1-3-10-18)16-23(20)32-25(22)27-24(29)21-12-6-8-17-7-4-5-11-19(17)21/h1-12H,13-14,16H2,(H,27,29)
NCI pathway
Reactome pathway
n/an/a>1.00E+4n/an/an/an/an/an/a
GlaxoSmithKline R&D
Curated by ChEMBL
Assay Description
Inhibition of human recombinant full length JNK1alpha1
Bioorg Med Chem Lett 17: 1296-301 (2007)
Article DOI: 10.1016/j.bmcl.2006.12.003
BindingDB Entry DOI: 10.7270/Q2TB1840