BDBM50411412 CHEMBL391198
SMILES: O=C(NC1CCCC1)Nc1sc2CCCCc2c1C#N
InChI Key: InChIKey=OLXKHUCPMYCFSB-UHFFFAOYSA-N
Data: 2 IC50
Activity Spreadsheet -- Enzyme Inhibition Constant Data from BindingDB
Found 2 hits for monomerid = 50411412
Trg + Lig
Ki
nM
ΔG°
kcal/mole
IC50
nM
Kd
nM
EC50/IC50
nM
koff
s-1
kon
M-1s-1
pHTemp
°C
Mitogen-activated protein kinase 14
(Homo sapiens (Human))
BDBM50411412
(CHEMBL391198)
Show SMILES O=C(NC1CCCC1)Nc1sc2CCCCc2c1C#N
Show InChI InChI=1S/C15H19N3OS/c16-9-12-11-7-3-4-8-13(11)20-14(12)18-15(19)17-10-5-1-2-6-10/h10H,1-8H2,(H2,17,18,19)
NCI pathway
Reactome pathway
n/an/a>1.58E+4n/an/an/an/an/an/a
GlaxoSmithKline R&D
Curated by ChEMBL
Assay Description
Inhibition of mitogen-activated protein kinase p38alpha
Bioorg Med Chem Lett 17: 1296-301 (2007)
Article DOI: 10.1016/j.bmcl.2006.12.003
BindingDB Entry DOI: 10.7270/Q2TB1840
Mitogen-activated protein kinase 10
(Homo sapiens (Human))
BDBM50411412
(CHEMBL391198)
Show SMILES O=C(NC1CCCC1)Nc1sc2CCCCc2c1C#N
Show InChI InChI=1S/C15H19N3OS/c16-9-12-11-7-3-4-8-13(11)20-14(12)18-15(19)17-10-5-1-2-6-10/h10H,1-8H2,(H2,17,18,19)
NCI pathway
Reactome pathway
n/an/a>1.58E+4n/an/an/an/an/an/a
GlaxoSmithKline R&D
Curated by ChEMBL
Assay Description
Inhibition of human truncated JNK3
Bioorg Med Chem Lett 17: 1296-301 (2007)
Article DOI: 10.1016/j.bmcl.2006.12.003
BindingDB Entry DOI: 10.7270/Q2TB1840