null
SMILES: Cc1ccc2c(NCC(O)(CC3(C)CCCc4ccccc34)C(F)(F)F)cccc2n1
InChI Key: InChIKey=DHLZHFIJSYWCJK-UHFFFAOYSA-N
Activity Spreadsheet -- Enzyme Inhibition Constant Data from BindingDB
Found 7 hits for monomerid = 50411479
Trg + Lig
Ki
nM
ΔG°
kcal/mole
IC50
nM
Kd
nM
EC50/IC50
nM
koff
s-1
kon
M-1s-1
pHTemp
°C
Glucocorticoid receptor
(Homo sapiens (Human))
BDBM50411479
(CHEMBL238360)
Show SMILES Cc1ccc2c(NCC(O)(CC3(C)CCCc4ccccc34)C(F)(F)F)cccc2n1
Show InChI InChI=1S/C25H27F3N2O/c1-17-12-13-19-21(10-5-11-22(19)30-17)29-16-24(31,25(26,27)28)15-23(2)14-6-8-18-7-3-4-9-20(18)23/h3-5,7,9-13,29,31H,6,8,14-16H2,1-2H3
n/an/a 0.501n/an/an/an/an/an/a
GlaxoSmithKline Medicines Research Centre
Curated by ChEMBL
Assay Description
Agonist activity at glucocorticoid receptor in human A549 cells by NF-kappaB transrepression assay
J Med Chem 50: 6519-34 (2007)
Article DOI: 10.1021/jm070778w
BindingDB Entry DOI: 10.7270/Q21R6RRR
Glucocorticoid receptor
(Homo sapiens (Human))
BDBM50411479
(CHEMBL238360)
Show SMILES Cc1ccc2c(NCC(O)(CC3(C)CCCc4ccccc34)C(F)(F)F)cccc2n1
Show InChI InChI=1S/C25H27F3N2O/c1-17-12-13-19-21(10-5-11-22(19)30-17)29-16-24(31,25(26,27)28)15-23(2)14-6-8-18-7-3-4-9-20(18)23/h3-5,7,9-13,29,31H,6,8,14-16H2,1-2H3
n/an/a 5.01n/an/an/an/an/an/a
GlaxoSmithKline Medicines Research Centre
Curated by ChEMBL
Assay Description
Displacement of fluorescent labeled Dexamethasone from glucocorticoid receptor
J Med Chem 50: 6519-34 (2007)
Article DOI: 10.1021/jm070778w
BindingDB Entry DOI: 10.7270/Q21R6RRR
Glucocorticoid receptor
(Homo sapiens (Human))
BDBM50411479
(CHEMBL238360)
Show SMILES Cc1ccc2c(NCC(O)(CC3(C)CCCc4ccccc34)C(F)(F)F)cccc2n1
Show InChI InChI=1S/C25H27F3N2O/c1-17-12-13-19-21(10-5-11-22(19)30-17)29-16-24(31,25(26,27)28)15-23(2)14-6-8-18-7-3-4-9-20(18)23/h3-5,7,9-13,29,31H,6,8,14-16H2,1-2H3
n/an/a 9.12n/an/an/an/an/an/a
GlaxoSmithKline Medicines Research Centre
Curated by ChEMBL
Assay Description
Displacement of fluorescent labeled Dexamethasone from glucocorticoid receptor
J Med Chem 50: 6519-34 (2007)
Article DOI: 10.1021/jm070778w
BindingDB Entry DOI: 10.7270/Q21R6RRR
Glucocorticoid receptor
(Homo sapiens (Human))
BDBM50411479
(CHEMBL238360)
Show SMILES Cc1ccc2c(NCC(O)(CC3(C)CCCc4ccccc34)C(F)(F)F)cccc2n1
Show InChI InChI=1S/C25H27F3N2O/c1-17-12-13-19-21(10-5-11-22(19)30-17)29-16-24(31,25(26,27)28)15-23(2)14-6-8-18-7-3-4-9-20(18)23/h3-5,7,9-13,29,31H,6,8,14-16H2,1-2H3
n/an/a 9.12n/an/an/an/an/an/a
GlaxoSmithKline Medicines Research Centre
Curated by ChEMBL
Assay Description
Agonist activity at glucocorticoid receptor in human A549 cells by NF-kappaB transrepression assay
J Med Chem 50: 6519-34 (2007)
Article DOI: 10.1021/jm070778w
BindingDB Entry DOI: 10.7270/Q21R6RRR
Glucocorticoid receptor
(Homo sapiens (Human))
BDBM50411479
(CHEMBL238360)
Show SMILES Cc1ccc2c(NCC(O)(CC3(C)CCCc4ccccc34)C(F)(F)F)cccc2n1
Show InChI InChI=1S/C25H27F3N2O/c1-17-12-13-19-21(10-5-11-22(19)30-17)29-16-24(31,25(26,27)28)15-23(2)14-6-8-18-7-3-4-9-20(18)23/h3-5,7,9-13,29,31H,6,8,14-16H2,1-2H3
n/an/a 77.6n/an/an/an/an/an/a
GlaxoSmithKline Medicines Research Centre
Curated by ChEMBL
Assay Description
Antagonist activity at glucocorticoid receptor in human A549 cells transfected with MMTV luciferase reporter gene assessed as inhibition of dexametha...
J Med Chem 50: 6519-34 (2007)
Article DOI: 10.1021/jm070778w
BindingDB Entry DOI: 10.7270/Q21R6RRR
Glucocorticoid receptor
(Homo sapiens (Human))
BDBM50411479
(CHEMBL238360)
Show SMILES Cc1ccc2c(NCC(O)(CC3(C)CCCc4ccccc34)C(F)(F)F)cccc2n1
Show InChI InChI=1S/C25H27F3N2O/c1-17-12-13-19-21(10-5-11-22(19)30-17)29-16-24(31,25(26,27)28)15-23(2)14-6-8-18-7-3-4-9-20(18)23/h3-5,7,9-13,29,31H,6,8,14-16H2,1-2H3
n/an/an/an/a 72.4n/an/an/an/a
GlaxoSmithKline Medicines Research Centre
Curated by ChEMBL
Assay Description
Agonist activity at glucocorticoid receptor in human A549 cells by MMTV transactivation assay
J Med Chem 50: 6519-34 (2007)
Article DOI: 10.1021/jm070778w
BindingDB Entry DOI: 10.7270/Q21R6RRR
Glucocorticoid receptor
(Homo sapiens (Human))
BDBM50411479
(CHEMBL238360)
Show SMILES Cc1ccc2c(NCC(O)(CC3(C)CCCc4ccccc34)C(F)(F)F)cccc2n1
Show InChI InChI=1S/C25H27F3N2O/c1-17-12-13-19-21(10-5-11-22(19)30-17)29-16-24(31,25(26,27)28)15-23(2)14-6-8-18-7-3-4-9-20(18)23/h3-5,7,9-13,29,31H,6,8,14-16H2,1-2H3
n/an/an/an/a 9.55n/an/an/an/a
GlaxoSmithKline Medicines Research Centre
Curated by ChEMBL
Assay Description
Agonist activity at glucocorticoid receptor in human A549 cells by MMTV transactivation assay
J Med Chem 50: 6519-34 (2007)
Article DOI: 10.1021/jm070778w
BindingDB Entry DOI: 10.7270/Q21R6RRR