BDBM50411698 CHEMBL271096
SMILES: CCc1nc2cc3CCN(CCCSc4nnc(-c5ccc(cc5)C(F)(F)F)n4C)CCc3cc2o1
InChI Key: InChIKey=QRWDBCPLADXSGV-UHFFFAOYSA-N
Data: 3 KI  1 IC50
Activity Spreadsheet -- Enzyme Inhibition Constant Data from BindingDB
Found 4 hits for monomerid = 50411698
Trg + Lig
Ki
nM
ΔG°
kcal/mole
IC50
nM
Kd
nM
EC50/IC50
nM
koff
s-1
kon
M-1s-1
pHTemp
°C
D(3) dopamine receptor
(Homo sapiens (Human))
BDBM50411698
(CHEMBL271096)
Show SMILES CCc1nc2cc3CCN(CCCSc4nnc(-c5ccc(cc5)C(F)(F)F)n4C)CCc3cc2o1
Show InChI InChI=1S/C26H28F3N5OS/c1-3-23-30-21-15-18-9-12-34(13-10-19(18)16-22(21)35-23)11-4-14-36-25-32-31-24(33(25)2)17-5-7-20(8-6-17)26(27,28)29/h5-8,15-16H,3-4,9-14H2,1-2H3
7.94n/an/an/an/an/an/an/an/a
GlaxoSmithKline
Curated by ChEMBL
Assay Description
Antagonist activity at human dopamine D3 receptor by cell based GTPgammaS binding assay
Bioorg Med Chem Lett 18: 901-7 (2008)
Article DOI: 10.1016/j.bmcl.2007.12.066
BindingDB Entry DOI: 10.7270/Q2MK6F32
D(2) dopamine receptor
(Homo sapiens (Human))
BDBM50411698
(CHEMBL271096)
Show SMILES CCc1nc2cc3CCN(CCCSc4nnc(-c5ccc(cc5)C(F)(F)F)n4C)CCc3cc2o1
Show InChI InChI=1S/C26H28F3N5OS/c1-3-23-30-21-15-18-9-12-34(13-10-19(18)16-22(21)35-23)11-4-14-36-25-32-31-24(33(25)2)17-5-7-20(8-6-17)26(27,28)29/h5-8,15-16H,3-4,9-14H2,1-2H3
Reactome pathway
>631n/an/an/an/an/an/an/an/a
GlaxoSmithKline
Curated by ChEMBL
Assay Description
Antagonist activity at dopamine D2 receptor by GTPgammaS binding assay
Bioorg Med Chem Lett 18: 901-7 (2008)
Article DOI: 10.1016/j.bmcl.2007.12.066
BindingDB Entry DOI: 10.7270/Q2MK6F32
Histamine H1 receptor
(Homo sapiens (Human))
BDBM50411698
(CHEMBL271096)
Show SMILES CCc1nc2cc3CCN(CCCSc4nnc(-c5ccc(cc5)C(F)(F)F)n4C)CCc3cc2o1
Show InChI InChI=1S/C26H28F3N5OS/c1-3-23-30-21-15-18-9-12-34(13-10-19(18)16-22(21)35-23)11-4-14-36-25-32-31-24(33(25)2)17-5-7-20(8-6-17)26(27,28)29/h5-8,15-16H,3-4,9-14H2,1-2H3
Reactome pathway
>3.16E+3n/an/an/an/an/an/an/an/a
GlaxoSmithKline
Curated by ChEMBL
Assay Description
Antagonist activity at histamine H1 receptor by FLIPR assay
Bioorg Med Chem Lett 18: 901-7 (2008)
Article DOI: 10.1016/j.bmcl.2007.12.066
BindingDB Entry DOI: 10.7270/Q2MK6F32
Potassium voltage-gated channel subfamily H member 2
(Homo sapiens (Human))
BDBM50411698
(CHEMBL271096)
Show SMILES CCc1nc2cc3CCN(CCCSc4nnc(-c5ccc(cc5)C(F)(F)F)n4C)CCc3cc2o1
Show InChI InChI=1S/C26H28F3N5OS/c1-3-23-30-21-15-18-9-12-34(13-10-19(18)16-22(21)35-23)11-4-14-36-25-32-31-24(33(25)2)17-5-7-20(8-6-17)26(27,28)29/h5-8,15-16H,3-4,9-14H2,1-2H3
Reactome pathway
n/an/a 251n/an/an/an/an/an/a
GlaxoSmithKline
Curated by ChEMBL
Assay Description
Displacement of [3H]Dofetilide from human ERG
Bioorg Med Chem Lett 18: 901-7 (2008)
Article DOI: 10.1016/j.bmcl.2007.12.066
BindingDB Entry DOI: 10.7270/Q2MK6F32