BDBM50411712 CHEMBL271083
SMILES: Cc1ncoc1-c1nnc(SCCCN2CCc3cc4nc(oc4cc3CC2)C(F)(F)C(F)(F)F)n1C
InChI Key: InChIKey=DOTHXJXYLNKQOQ-UHFFFAOYSA-N
Data: 3 KI  1 IC50
Activity Spreadsheet -- Enzyme Inhibition Constant Data from BindingDB
Found 4 hits for monomerid = 50411712
Trg + Lig
Ki
nM
ΔG°
kcal/mole
IC50
nM
Kd
nM
EC50/IC50
nM
koff
s-1
kon
M-1s-1
pHTemp
°C
D(3) dopamine receptor
(Homo sapiens (Human))
BDBM50411712
(CHEMBL271083)
Show SMILES Cc1ncoc1-c1nnc(SCCCN2CCc3cc4nc(oc4cc3CC2)C(F)(F)C(F)(F)F)n1C
Show InChI InChI=1S/C23H23F5N6O2S/c1-13-18(35-12-29-13)19-31-32-21(33(19)2)37-9-3-6-34-7-4-14-10-16-17(11-15(14)5-8-34)36-20(30-16)22(24,25)23(26,27)28/h10-12H,3-9H2,1-2H3
3.16n/an/an/an/an/an/an/an/a
GlaxoSmithKline
Curated by ChEMBL
Assay Description
Antagonist activity at human dopamine D3 receptor by cell based GTPgammaS binding assay
Bioorg Med Chem Lett 18: 901-7 (2008)
Article DOI: 10.1016/j.bmcl.2007.12.066
BindingDB Entry DOI: 10.7270/Q2MK6F32
D(2) dopamine receptor
(Homo sapiens (Human))
BDBM50411712
(CHEMBL271083)
Show SMILES Cc1ncoc1-c1nnc(SCCCN2CCc3cc4nc(oc4cc3CC2)C(F)(F)C(F)(F)F)n1C
Show InChI InChI=1S/C23H23F5N6O2S/c1-13-18(35-12-29-13)19-31-32-21(33(19)2)37-9-3-6-34-7-4-14-10-16-17(11-15(14)5-8-34)36-20(30-16)22(24,25)23(26,27)28/h10-12H,3-9H2,1-2H3
Reactome pathway
>631n/an/an/an/an/an/an/an/a
GlaxoSmithKline
Curated by ChEMBL
Assay Description
Antagonist activity at dopamine D2 receptor by GTPgammaS binding assay
Bioorg Med Chem Lett 18: 901-7 (2008)
Article DOI: 10.1016/j.bmcl.2007.12.066
BindingDB Entry DOI: 10.7270/Q2MK6F32
Histamine H1 receptor
(Homo sapiens (Human))
BDBM50411712
(CHEMBL271083)
Show SMILES Cc1ncoc1-c1nnc(SCCCN2CCc3cc4nc(oc4cc3CC2)C(F)(F)C(F)(F)F)n1C
Show InChI InChI=1S/C23H23F5N6O2S/c1-13-18(35-12-29-13)19-31-32-21(33(19)2)37-9-3-6-34-7-4-14-10-16-17(11-15(14)5-8-34)36-20(30-16)22(24,25)23(26,27)28/h10-12H,3-9H2,1-2H3
Reactome pathway
>2.51E+3n/an/an/an/an/an/an/an/a
GlaxoSmithKline
Curated by ChEMBL
Assay Description
Antagonist activity at histamine H1 receptor by FLIPR assay
Bioorg Med Chem Lett 18: 901-7 (2008)
Article DOI: 10.1016/j.bmcl.2007.12.066
BindingDB Entry DOI: 10.7270/Q2MK6F32
Potassium voltage-gated channel subfamily H member 2
(Homo sapiens (Human))
BDBM50411712
(CHEMBL271083)
Show SMILES Cc1ncoc1-c1nnc(SCCCN2CCc3cc4nc(oc4cc3CC2)C(F)(F)C(F)(F)F)n1C
Show InChI InChI=1S/C23H23F5N6O2S/c1-13-18(35-12-29-13)19-31-32-21(33(19)2)37-9-3-6-34-7-4-14-10-16-17(11-15(14)5-8-34)36-20(30-16)22(24,25)23(26,27)28/h10-12H,3-9H2,1-2H3
Reactome pathway
n/an/a 200n/an/an/an/an/an/a
GlaxoSmithKline
Curated by ChEMBL
Assay Description
Displacement of [3H]Dofetilide from human ERG
Bioorg Med Chem Lett 18: 901-7 (2008)
Article DOI: 10.1016/j.bmcl.2007.12.066
BindingDB Entry DOI: 10.7270/Q2MK6F32