BDBM50412081 CHEMBL505436
SMILES: C[C@@H]([C@H]1CC[C@H]2[C@@H]3CC[C@H]4[C@@H](OC(C)=O)[C@H]([C@H](O)C[C@]4(C)[C@H]3CC[C@]12C)N1C(=O)c2ccccc2C1=O)N(C)C
InChI Key: InChIKey=YUUHBLRWEZLNID-WASWYHNUSA-N
Data: 1 IC50
Activity Spreadsheet -- Enzyme Inhibition Constant Data from BindingDB
Found 1 hit for monomerid = 50412081
Trg + Lig
Ki
nM
ΔG°
kcal/mole
IC50
nM
Kd
nM
EC50/IC50
nM
koff
s-1
kon
M-1s-1
pHTemp
°C
Anti-estrogen binding site (AEBS)
(Homo sapiens (Human))
BDBM50412081
(CHEMBL505436)
Show SMILES C[C@@H]([C@H]1CC[C@H]2[C@@H]3CC[C@H]4[C@@H](OC(C)=O)[C@H]([C@H](O)C[C@]4(C)[C@H]3CC[C@]12C)N1C(=O)c2ccccc2C1=O)N(C)C |r|
Show InChI InChI=1S/C33H46N2O5/c1-18(34(5)6)23-13-14-24-22-11-12-26-29(40-19(2)36)28(35-30(38)20-9-7-8-10-21(20)31(35)39)27(37)17-33(26,4)25(22)15-16-32(23,24)3/h7-10,18,22-29,37H,11-17H2,1-6H3/t18-,22-,23+,24-,25-,26-,27+,28-,29+,32+,33+/m0/s1
Reactome pathway
n/an/a 6.80E+3n/an/an/an/an/an/a
University of Illinois at Chicago
Curated by ChEMBL
Assay Description
Displacement of [3H]tamoxifen from antiestrogen binding site in Sprague-Dawley rat liver by liquid scintillation counting
J Nat Prod 61: 1257-62 (1998)
Article DOI: 10.1021/np980162x
BindingDB Entry DOI: 10.7270/Q2B27WJ0