BDBM50412337 CHEMBL498516
SMILES: COc1ccc(Br)cc1C1Sc2ccc(cc2N(C)C1=O)C(F)(F)F
InChI Key: InChIKey=LJVSNRFQDYECPE-UHFFFAOYSA-N
Data: 1 IC50
Activity Spreadsheet -- Enzyme Inhibition Constant Data from BindingDB
Found 1 hit for monomerid = 50412337
Trg + Lig
Ki
nM
ΔG°
kcal/mole
IC50
nM
Kd
nM
EC50/IC50
nM
koff
s-1
kon
M-1s-1
pHTemp
°C
Calcium-activated potassium channel subunit alpha-1
(Rattus norvegicus)
BDBM50412337
(CHEMBL498516)
Show SMILES COc1ccc(Br)cc1C1Sc2ccc(cc2N(C)C1=O)C(F)(F)F
Show InChI InChI=1S/C17H13BrF3NO2S/c1-22-12-7-9(17(19,20)21)3-6-14(12)25-15(16(22)23)11-8-10(18)4-5-13(11)24-2/h3-8,15H,1-2H3
Reactome pathway
n/an/a 617n/an/an/an/an/an/a
Universit£ degli Studi di Pisa
Curated by ChEMBL
Assay Description
Activation of large-conductance calcium-activated potassium channel-mediated vasorelaxation in endothelium-denuded normotensive Wistar rat thoracic a...
J Med Chem 51: 5085-92 (2008)
Article DOI: 10.1021/jm701605f
BindingDB Entry DOI: 10.7270/Q2R49S16