BDBM50412385 CHEMBL2021488
SMILES: CCCOC1[C@H](O)CC(C[C@H]1O)=C\C=C1/CCC[C@@]2(C)C1CC=C2C(C)SCCCC(O)(CC)CC
InChI Key: InChIKey=NQFOMGQNJLTALY-DOVNICDTSA-N
Data: 2 EC50
Activity Spreadsheet -- Enzyme Inhibition Constant Data from BindingDB
Found 2 hits for monomerid = 50412385
Trg + Lig
Ki
nM
ΔG°
kcal/mole
IC50
nM
Kd
nM
EC50/IC50
nM
koff
s-1
kon
M-1s-1
pHTemp
°C
Vitamin D receptor
(Mus musculus)
BDBM50412385
(CHEMBL2021488)
Show SMILES CCCOC1[C@H](O)CC(C[C@H]1O)=C\C=C1/CCC[C@@]2(C)C1CC=C2C(C)SCCCC(O)(CC)CC |r,wU:18.19,10.11,wD:5.5,4.3,c:24,@@:4,(-19.88,-.17,;-21.22,.6,;-22.55,-.17,;-23.88,.6,;-23.88,2.14,;-25.22,2.91,;-26.55,2.14,;-25.22,4.45,;-23.88,5.22,;-22.55,4.45,;-22.55,2.91,;-21.22,2.14,;-23.88,6.76,;-22.55,7.53,;-22.55,9.07,;-23.88,9.84,;-23.88,11.38,;-22.55,12.15,;-21.22,11.38,;-21.22,12.92,;-21.22,9.84,;-19.75,9.37,;-18.85,10.61,;-19.75,11.86,;-19.28,13.33,;-20.31,14.47,;-17.77,13.65,;-16.68,12.56,;-15.19,12.96,;-14.1,11.87,;-12.62,12.26,;-11.19,12.85,;-12.62,13.8,;-11.28,14.57,;-11.53,11.18,;-10.04,11.57,)|
Show InChI InChI=1S/C31H52O4S/c1-6-18-35-29-27(32)20-23(21-28(29)33)12-13-24-11-9-16-30(5)25(14-15-26(24)30)22(4)36-19-10-17-31(34,7-2)8-3/h12-14,22,26-29,32-34H,6-11,15-21H2,1-5H3/b23-12-,24-13+/t22?,26?,27-,28-,29?,30-/m1/s1
Reactome pathway
n/an/an/an/a 0.0900n/an/an/an/a
Tokyo Medical and Dental University
Curated by ChEMBL
Assay Description
Increase in mouse VDR-mediated transcriptional activity in african green monkey COS7 cells after 24 hrs by luciferase assay
Bioorg Med Chem 16: 6949-64 (2008)
Article DOI: 10.1016/j.bmc.2008.05.043
BindingDB Entry DOI: 10.7270/Q2Z60NWW
Vitamin D receptor
(Mus musculus)
BDBM50412385
(CHEMBL2021488)
Show SMILES CCCOC1[C@H](O)CC(C[C@H]1O)=C\C=C1/CCC[C@@]2(C)C1CC=C2C(C)SCCCC(O)(CC)CC |r,wU:18.19,10.11,wD:5.5,4.3,c:24,@@:4,(-19.88,-.17,;-21.22,.6,;-22.55,-.17,;-23.88,.6,;-23.88,2.14,;-25.22,2.91,;-26.55,2.14,;-25.22,4.45,;-23.88,5.22,;-22.55,4.45,;-22.55,2.91,;-21.22,2.14,;-23.88,6.76,;-22.55,7.53,;-22.55,9.07,;-23.88,9.84,;-23.88,11.38,;-22.55,12.15,;-21.22,11.38,;-21.22,12.92,;-21.22,9.84,;-19.75,9.37,;-18.85,10.61,;-19.75,11.86,;-19.28,13.33,;-20.31,14.47,;-17.77,13.65,;-16.68,12.56,;-15.19,12.96,;-14.1,11.87,;-12.62,12.26,;-11.19,12.85,;-12.62,13.8,;-11.28,14.57,;-11.53,11.18,;-10.04,11.57,)|
Show InChI InChI=1S/C31H52O4S/c1-6-18-35-29-27(32)20-23(21-28(29)33)12-13-24-11-9-16-30(5)25(14-15-26(24)30)22(4)36-19-10-17-31(34,7-2)8-3/h12-14,22,26-29,32-34H,6-11,15-21H2,1-5H3/b23-12-,24-13+/t22?,26?,27-,28-,29?,30-/m1/s1
Reactome pathway
n/an/an/an/a 0.0900n/an/an/an/a
Tokyo Medical and Dental University
Curated by ChEMBL
Assay Description
Increase in mouse VDR-mediated transcriptional activity in african green monkey COS7 cells after 24 hrs by luciferase assay
Bioorg Med Chem 16: 6949-64 (2008)
Article DOI: 10.1016/j.bmc.2008.05.043
BindingDB Entry DOI: 10.7270/Q2Z60NWW