BDBM50412394 CHEMBL511488
SMILES: CCOC(=O)c1cnc2n(CC)ncc2c1NC1CCCCC1
InChI Key: InChIKey=DDAUUBIDZKMIDP-UHFFFAOYSA-N
Data: 1 IC50
Activity Spreadsheet -- Enzyme Inhibition Constant Data from BindingDB
Found 1 hit for monomerid = 50412394
Trg + Lig
Ki
nM
ΔG°
kcal/mole
IC50
nM
Kd
nM
EC50/IC50
nM
koff
s-1
kon
M-1s-1
pHTemp
°C
cAMP-specific 3',5'-cyclic phosphodiesterase 4B
(Homo sapiens (Human))
BDBM50412394
(CHEMBL511488)
Show SMILES CCOC(=O)c1cnc2n(CC)ncc2c1NC1CCCCC1
Show InChI InChI=1S/C17H24N4O2/c1-3-21-16-13(11-19-21)15(20-12-8-6-5-7-9-12)14(10-18-16)17(22)23-4-2/h10-12H,3-9H2,1-2H3,(H,18,20)
n/an/a 10n/an/an/an/an/an/a
GlaxoSmithKline Medicines Research Centre
Curated by ChEMBL
Assay Description
Inhibition of human PDE4B in Sf9 cells
Bioorg Med Chem Lett 18: 4237-41 (2008)
Article DOI: 10.1016/j.bmcl.2008.05.052
BindingDB Entry DOI: 10.7270/Q2ZP47B3