BDBM50412414 CHEMBL521203
SMILES: CCn1ncc2c(NC3CCOCC3)c(cnc12)C(=O)NCc1ccccc1
InChI Key: InChIKey=QZGJNFBMYYEFGM-UHFFFAOYSA-N
Data: 1 IC50
PDB links: 1 PDB ID matches this monomer.
Activity Spreadsheet -- Enzyme Inhibition Constant Data from BindingDB
Found 1 hit for monomerid = 50412414
Trg + Lig
Ki
nM
ΔG°
kcal/mole
IC50
nM
Kd
nM
EC50/IC50
nM
koff
s-1
kon
M-1s-1
pHTemp
°C
3',5'-cyclic phosphodiesterase
(Homo sapiens (Human))
BDBM50412414
(CHEMBL521203)
Show SMILES CCn1ncc2c(NC3CCOCC3)c(cnc12)C(=O)NCc1ccccc1
Show InChI InChI=1S/C21H25N5O2/c1-2-26-20-17(14-24-26)19(25-16-8-10-28-11-9-16)18(13-22-20)21(27)23-12-15-6-4-3-5-7-15/h3-7,13-14,16H,2,8-12H2,1H3,(H,22,25)(H,23,27)
n/an/a 3.16n/an/an/an/an/an/a
GlaxoSmithKline Medicines Research Centre
Curated by ChEMBL
Assay Description
Inhibition of human PDE4B in Sf9 cells
Bioorg Med Chem Lett 18: 4237-41 (2008)
Article DOI: 10.1016/j.bmcl.2008.05.052
BindingDB Entry DOI: 10.7270/Q2ZP47B3
3D
3D Structure (crystal)