BDBM50412599 CHEMBL459950
SMILES: CC1(C)[C@@H]2CC[C@@]1(CS(=O)(=O)N1CCN(CC1)c1ccc(cn1)C(F)(F)F)C(O)C2
InChI Key: InChIKey=VKSSJQWARREZDB-WDOBJEIGSA-N
Data: 1 IC50
Activity Spreadsheet -- Enzyme Inhibition Constant Data from BindingDB
Found 1 hit for monomerid = 50412599
Trg + Lig
Ki
nM
ΔG°
kcal/mole
IC50
nM
Kd
nM
EC50/IC50
nM
koff
s-1
kon
M-1s-1
pHTemp
°C
chemokine (C-X-C motif) receptor 3
(Homo sapiens (Human))
BDBM50412599
(CHEMBL459950)
Show SMILES CC1(C)[C@@H]2CC[C@@]1(CS(=O)(=O)N1CCN(CC1)c1ccc(cn1)C(F)(F)F)C(O)C2 |r,THB:28:27:5.4:1|
Show InChI InChI=1S/C20H28F3N3O3S/c1-18(2)14-5-6-19(18,16(27)11-14)13-30(28,29)26-9-7-25(8-10-26)17-4-3-15(12-24-17)20(21,22)23/h3-4,12,14,16,27H,5-11,13H2,1-2H3/t14-,16?,19-/m1/s1
n/an/a 158n/an/an/an/an/an/a
GlaxoSmithKline
Curated by ChEMBL
Assay Description
Antagonist activity at human recombinant CXCR3 receptor expressed in CHO-K1 cells assessed as human IP10-induced calcium flux by FLIPR assay
Bioorg Med Chem Lett 19: 114-8 (2008)
Article DOI: 10.1016/j.bmcl.2008.11.008
BindingDB Entry DOI: 10.7270/Q29Z94R0