BDBM50412636 CHEMBL453712
SMILES: COc1ccc(cc1NC(=O)c1ccccc1O)[N+]([O-])=O
InChI Key: InChIKey=IEPFGMASGCKFHX-UHFFFAOYSA-N
Data: 1 IC50
Activity Spreadsheet -- Enzyme Inhibition Constant Data from BindingDB
Found 1 hit for monomerid = 50412636
Trg + Lig
Ki
nM
ΔG°
kcal/mole
IC50
nM
Kd
nM
EC50/IC50
nM
koff
s-1
kon
M-1s-1
pHTemp
°C
Calcium-activated potassium channel alpha/beta 1
(Homo sapiens (Human))
BDBM50412636
(CHEMBL453712)
Show SMILES COc1ccc(cc1NC(=O)c1ccccc1O)[N+]([O-])=O
Show InChI InChI=1S/C14H12N2O5/c1-21-13-7-6-9(16(19)20)8-11(13)15-14(18)10-4-2-3-5-12(10)17/h2-8,17H,1H3,(H,15,18)
Reactome pathway
n/an/a 447n/an/an/an/an/an/a
Universit£ di Pisa
Curated by ChEMBL
Assay Description
Activation of BK channel-mediated vasorelaxation activity assessed as reduction in KCl-induced contractile tone
Bioorg Med Chem 17: 319-25 (2008)
Article DOI: 10.1016/j.bmc.2008.10.068
BindingDB Entry DOI: 10.7270/Q2P84D59