BDBM50412641 CHEMBL512408
SMILES: Oc1ccccc1C(=O)n1nnc2cc(ccc12)C(F)(F)F
InChI Key: InChIKey=SQRORWZBFWRVKA-UHFFFAOYSA-N
Data: 1 IC50
Activity Spreadsheet -- Enzyme Inhibition Constant Data from BindingDB
Found 1 hit for monomerid = 50412641
Trg + Lig
Ki
nM
ΔG°
kcal/mole
IC50
nM
Kd
nM
EC50/IC50
nM
koff
s-1
kon
M-1s-1
pHTemp
°C
Calcium-activated potassium channel alpha/beta 1
(Homo sapiens (Human))
BDBM50412641
(CHEMBL512408)
Show SMILES Oc1ccccc1C(=O)n1nnc2cc(ccc12)C(F)(F)F
Show InChI InChI=1S/C14H8F3N3O2/c15-14(16,17)8-5-6-11-10(7-8)18-19-20(11)13(22)9-3-1-2-4-12(9)21/h1-7,21H
Reactome pathway
n/an/a 2.14E+3n/an/an/an/an/an/a
Universit£ di Pisa
Curated by ChEMBL
Assay Description
Activation of BK channel-mediated vasorelaxation activity assessed as reduction in KCl-induced contractile tone
Bioorg Med Chem 17: 319-25 (2008)
Article DOI: 10.1016/j.bmc.2008.10.068
BindingDB Entry DOI: 10.7270/Q2P84D59