BDBM50412647 CHEMBL481578
SMILES: Oc1ccccc1C(=O)n1nnc2cc(ccc12)-c1ccccc1
InChI Key: InChIKey=MPIOSXUIBYSWID-UHFFFAOYSA-N
Data: 1 IC50
Activity Spreadsheet -- Enzyme Inhibition Constant Data from BindingDB
Found 1 hit for monomerid = 50412647
Trg + Lig
Ki
nM
ΔG°
kcal/mole
IC50
nM
Kd
nM
EC50/IC50
nM
koff
s-1
kon
M-1s-1
pHTemp
°C
Calcium-activated potassium channel alpha/beta 1
(Homo sapiens (Human))
BDBM50412647
(CHEMBL481578)
Show SMILES Oc1ccccc1C(=O)n1nnc2cc(ccc12)-c1ccccc1
Show InChI InChI=1S/C19H13N3O2/c23-18-9-5-4-8-15(18)19(24)22-17-11-10-14(12-16(17)20-21-22)13-6-2-1-3-7-13/h1-12,23H
Reactome pathway
n/an/a 3.31E+3n/an/an/an/an/an/a
Universit£ di Pisa
Curated by ChEMBL
Assay Description
Activation of BK channel-mediated vasorelaxation activity assessed as reduction in KCl-induced contractile tone
Bioorg Med Chem 17: 319-25 (2008)
Article DOI: 10.1016/j.bmc.2008.10.068
BindingDB Entry DOI: 10.7270/Q2P84D59