BDBM50412649 CHEMBL480795
SMILES: Cc1ccc(NC(=O)c2cc(Cl)ccc2O)c(c1)[N+]([O-])=O
InChI Key: InChIKey=IQJXLAUVNZXDJM-UHFFFAOYSA-N
Data: 1 IC50
Activity Spreadsheet -- Enzyme Inhibition Constant Data from BindingDB
Found 1 hit for monomerid = 50412649
Trg + Lig
Ki
nM
ΔG°
kcal/mole
IC50
nM
Kd
nM
EC50/IC50
nM
koff
s-1
kon
M-1s-1
pHTemp
°C
Calcium-activated potassium channel alpha/beta 1
(Homo sapiens (Human))
BDBM50412649
(CHEMBL480795)
Show SMILES Cc1ccc(NC(=O)c2cc(Cl)ccc2O)c(c1)[N+]([O-])=O
Show InChI InChI=1S/C14H11ClN2O4/c1-8-2-4-11(12(6-8)17(20)21)16-14(19)10-7-9(15)3-5-13(10)18/h2-7,18H,1H3,(H,16,19)
Reactome pathway
n/an/a 4.07E+3n/an/an/an/an/an/a
Universit£ di Pisa
Curated by ChEMBL
Assay Description
Activation of BK channel-mediated vasorelaxation activity assessed as reduction in KCl-induced contractile tone
Bioorg Med Chem 17: 319-25 (2008)
Article DOI: 10.1016/j.bmc.2008.10.068
BindingDB Entry DOI: 10.7270/Q2P84D59