BDBM50412653 CHEMBL481781
SMILES: Oc1ccc(cc1NC(=O)c1ccccc1O)[N+]([O-])=O
InChI Key: InChIKey=PTBAZLJPSSJIEM-UHFFFAOYSA-N
Data: 1 IC50
Activity Spreadsheet -- Enzyme Inhibition Constant Data from BindingDB
Found 1 hit for monomerid = 50412653
Trg + Lig
Ki
nM
ΔG°
kcal/mole
IC50
nM
Kd
nM
EC50/IC50
nM
koff
s-1
kon
M-1s-1
pHTemp
°C
Calcium-activated potassium channel alpha/beta 1
(Homo sapiens (Human))
BDBM50412653
(CHEMBL481781)
Show SMILES Oc1ccc(cc1NC(=O)c1ccccc1O)[N+]([O-])=O
Show InChI InChI=1S/C13H10N2O5/c16-11-4-2-1-3-9(11)13(18)14-10-7-8(15(19)20)5-6-12(10)17/h1-7,16-17H,(H,14,18)
Reactome pathway
n/an/a 8.13E+3n/an/an/an/an/an/a
Universit£ di Pisa
Curated by ChEMBL
Assay Description
Activation of BK channel-mediated vasorelaxation activity assessed as reduction in KCl-induced contractile tone
Bioorg Med Chem 17: 319-25 (2008)
Article DOI: 10.1016/j.bmc.2008.10.068
BindingDB Entry DOI: 10.7270/Q2P84D59