BDBM50412664 CHEMBL501328
SMILES: Oc1ccc(Cl)cc1NC(=O)c1ccc(F)cc1
InChI Key: InChIKey=PXBIMOHSXYTDEU-UHFFFAOYSA-N
Data: 1 IC50
Activity Spreadsheet -- Enzyme Inhibition Constant Data from BindingDB
Found 1 hit for monomerid = 50412664
Trg + Lig
Ki
nM
ΔG°
kcal/mole
IC50
nM
Kd
nM
EC50/IC50
nM
koff
s-1
kon
M-1s-1
pHTemp
°C
Calcium-activated potassium channel subunit alpha-1
(Homo sapiens (Human))
BDBM50412664
(CHEMBL501328)
Show SMILES Oc1ccc(Cl)cc1NC(=O)c1ccc(F)cc1
Show InChI InChI=1S/C13H9ClFNO2/c14-9-3-6-12(17)11(7-9)16-13(18)8-1-4-10(15)5-2-8/h1-7,17H,(H,16,18)
Reactome pathway
n/an/a 1.74E+4n/an/an/an/an/an/a
Universit£ di Pisa
Curated by ChEMBL
Assay Description
Activation of BK channel-mediated vasorelaxation activity assessed as reduction in KCl-induced contractile tone
Bioorg Med Chem 17: 319-25 (2008)
Article DOI: 10.1016/j.bmc.2008.10.068
BindingDB Entry DOI: 10.7270/Q2P84D59