BDBM50412802 CHEMBL515363
SMILES: COc1ccc(N2CCc3c2nc(C)cc3-n2ccc(n2)-n2cc[nH]c2=O)c(C)c1
InChI Key: InChIKey=RJRWNOIAPUDOLR-UHFFFAOYSA-N
Data: 1 IC50
Activity Spreadsheet -- Enzyme Inhibition Constant Data from BindingDB
Found 1 hit for monomerid = 50412802
Trg + Lig
Ki
nM
ΔG°
kcal/mole
IC50
nM
Kd
nM
EC50/IC50
nM
koff
s-1
kon
M-1s-1
pHTemp
°C
Corticotropin releasing factor receptor 1
(Homo sapiens (Human))
BDBM50412802
(CHEMBL515363)
Show SMILES COc1ccc(N2CCc3c2nc(C)cc3-n2ccc(n2)-n2cc[nH]c2=O)c(C)c1
Show InChI InChI=1S/C22H22N6O2/c1-14-12-16(30-3)4-5-18(14)26-9-6-17-19(13-15(2)24-21(17)26)28-10-7-20(25-28)27-11-8-23-22(27)29/h4-5,7-8,10-13H,6,9H2,1-3H3,(H,23,29)
Reactome pathway
n/an/a 120n/an/an/an/an/an/a
GlaxoSmithKline Medicines Research Centre
Curated by ChEMBL
Assay Description
Displacement of [125I]sauvagine from human recombinant CRF1 receptor expressed in CHO cells
J Med Chem 51: 7370-9 (2009)
Article DOI: 10.1021/jm800744m
BindingDB Entry DOI: 10.7270/Q2N87C1X