BDBM50412992 CHEMBL457788
SMILES: Cc1c(Cn2ncc(N3CCNCC3)c(Cl)c2=O)cccc1NC(=O)c1cccnc1
InChI Key: InChIKey=SSRALUHRQZHILF-UHFFFAOYSA-N
Data: 1 EC50
Activity Spreadsheet -- Enzyme Inhibition Constant Data from BindingDB
Found 1 hit for monomerid = 50412992
Trg + Lig
Ki
nM
ΔG°
kcal/mole
IC50
nM
Kd
nM
EC50/IC50
nM
koff
s-1
kon
M-1s-1
pHTemp
°C
Mas-related G-protein coupled receptor member X1
(Homo sapiens (Human))
BDBM50412992
(CHEMBL457788)
Show SMILES Cc1c(Cn2ncc(N3CCNCC3)c(Cl)c2=O)cccc1NC(=O)c1cccnc1
Show InChI InChI=1S/C22H23ClN6O2/c1-15-17(4-2-6-18(15)27-21(30)16-5-3-7-25-12-16)14-29-22(31)20(23)19(13-26-29)28-10-8-24-9-11-28/h2-7,12-13,24H,8-11,14H2,1H3,(H,27,30)
n/an/an/an/a 2.00E+4n/an/an/an/a
GlaxoSmithKline Pharmaceuticals
Curated by ChEMBL
Assay Description
Agonist activity at human MrgX1 receptor expressed in HEK293 cells assessed as intracellular calcium mobilization by FLIPR assay
J Med Chem 52: 818-25 (2009)
Article DOI: 10.1021/jm800962k
BindingDB Entry DOI: 10.7270/Q2R212MD