BDBM50413003 CHEMBL475282
SMILES: COc1ccc(cn1)-c1ccc(cc1)C(=O)Nc1cccc(Cn2ncc(N3CCN(C)CC3)c(Cl)c2=O)c1C
InChI Key: InChIKey=IUZKBFCBDOJCDA-UHFFFAOYSA-N
Data: 1 EC50
Activity Spreadsheet -- Enzyme Inhibition Constant Data from BindingDB
Found 1 hit for monomerid = 50413003
Trg + Lig
Ki
nM
ΔG°
kcal/mole
IC50
nM
Kd
nM
EC50/IC50
nM
koff
s-1
kon
M-1s-1
pHTemp
°C
Mas-related G-protein coupled receptor member X1
(Homo sapiens (Human))
BDBM50413003
(CHEMBL475282)
Show SMILES COc1ccc(cn1)-c1ccc(cc1)C(=O)Nc1cccc(Cn2ncc(N3CCN(C)CC3)c(Cl)c2=O)c1C
Show InChI InChI=1S/C30H31ClN6O3/c1-20-24(19-37-30(39)28(31)26(18-33-37)36-15-13-35(2)14-16-36)5-4-6-25(20)34-29(38)22-9-7-21(8-10-22)23-11-12-27(40-3)32-17-23/h4-12,17-18H,13-16,19H2,1-3H3,(H,34,38)
n/an/an/an/a 123n/an/an/an/a
GlaxoSmithKline Pharmaceuticals
Curated by ChEMBL
Assay Description
Agonist activity at human MrgX1 receptor expressed in HEK293 cells assessed as intracellular calcium mobilization by FLIPR assay
J Med Chem 52: 818-25 (2009)
Article DOI: 10.1021/jm800962k
BindingDB Entry DOI: 10.7270/Q2R212MD