BDBM50413007 CHEMBL500240
SMILES: COc1ccc(cn1)-c1ccc(cc1)C(=O)Nc1cccc(Cn2ncc(N3CCNC(C3)C(N)=O)c(Cl)c2=O)c1C
InChI Key: InChIKey=OACZLQJNFVJISX-UHFFFAOYSA-N
Data: 1 EC50
Activity Spreadsheet -- Enzyme Inhibition Constant Data from BindingDB
Found 1 hit for monomerid = 50413007
Trg + Lig
Ki
nM
ΔG°
kcal/mole
IC50
nM
Kd
nM
EC50/IC50
nM
koff
s-1
kon
M-1s-1
pHTemp
°C
Mas-related G-protein coupled receptor member X1
(Homo sapiens (Human))
BDBM50413007
(CHEMBL500240)
Show SMILES COc1ccc(cn1)-c1ccc(cc1)C(=O)Nc1cccc(Cn2ncc(N3CCNC(C3)C(N)=O)c(Cl)c2=O)c1C
Show InChI InChI=1S/C30H30ClN7O4/c1-18-22(16-38-30(41)27(31)25(15-35-38)37-13-12-33-24(17-37)28(32)39)4-3-5-23(18)36-29(40)20-8-6-19(7-9-20)21-10-11-26(42-2)34-14-21/h3-11,14-15,24,33H,12-13,16-17H2,1-2H3,(H2,32,39)(H,36,40)
n/an/an/an/a 7.08E+3n/an/an/an/a
GlaxoSmithKline Pharmaceuticals
Curated by ChEMBL
Assay Description
Agonist activity at human MrgX1 receptor expressed in HEK293 cells assessed as intracellular calcium mobilization by FLIPR assay
J Med Chem 52: 818-25 (2009)
Article DOI: 10.1021/jm800962k
BindingDB Entry DOI: 10.7270/Q2R212MD