BDBM50413009 CHEMBL499944
SMILES: COc1ccc(cn1)-c1ccc(cc1)C(=O)Nc1cccc(Cn2ncc(N3CCN(CC3)C(C)=O)c(Cl)c2=O)c1C
InChI Key: InChIKey=VFOZGTRLWIEYPE-UHFFFAOYSA-N
Data: 1 EC50
Activity Spreadsheet -- Enzyme Inhibition Constant Data from BindingDB
Found 1 hit for monomerid = 50413009
Trg + Lig
Ki
nM
ΔG°
kcal/mole
IC50
nM
Kd
nM
EC50/IC50
nM
koff
s-1
kon
M-1s-1
pHTemp
°C
Mas-related G-protein coupled receptor member X1
(Homo sapiens (Human))
BDBM50413009
(CHEMBL499944)
Show SMILES COc1ccc(cn1)-c1ccc(cc1)C(=O)Nc1cccc(Cn2ncc(N3CCN(CC3)C(C)=O)c(Cl)c2=O)c1C
Show InChI InChI=1S/C31H31ClN6O4/c1-20-25(19-38-31(41)29(32)27(18-34-38)37-15-13-36(14-16-37)21(2)39)5-4-6-26(20)35-30(40)23-9-7-22(8-10-23)24-11-12-28(42-3)33-17-24/h4-12,17-18H,13-16,19H2,1-3H3,(H,35,40)
n/an/an/an/a 3.24E+4n/an/an/an/a
GlaxoSmithKline Pharmaceuticals
Curated by ChEMBL
Assay Description
Agonist activity at human MrgX1 receptor expressed in HEK293 cells assessed as intracellular calcium mobilization by FLIPR assay
J Med Chem 52: 818-25 (2009)
Article DOI: 10.1021/jm800962k
BindingDB Entry DOI: 10.7270/Q2R212MD