BDBM50413104 CHEMBL540144
SMILES: CCOC(=O)c1ccc(NC(=O)N[C@@H](Cc2ccc(O)cc2)C(=O)N[C@H]2CC[N+](C)(Cc3ccc(F)cc3)C2)cc1
InChI Key: InChIKey=HBJANPVGVPJJER-ZPGRGFNWSA-O
Data: 3 IC50
Activity Spreadsheet -- Enzyme Inhibition Constant Data from BindingDB
Found 3 hits for monomerid = 50413104
Trg + Lig
Ki
nM
ΔG°
kcal/mole
IC50
nM
Kd
nM
EC50/IC50
nM
koff
s-1
kon
M-1s-1
pHTemp
°C
Muscarinic acetylcholine receptor M2
(Homo sapiens (Human))
BDBM50413104
(CHEMBL540144)
Show SMILES CCOC(=O)c1ccc(NC(=O)N[C@@H](Cc2ccc(O)cc2)C(=O)N[C@H]2CC[N+](C)(Cc3ccc(F)cc3)C2)cc1 |r|
Show InChI InChI=1S/C31H35FN4O5/c1-3-41-30(39)23-8-12-25(13-9-23)34-31(40)35-28(18-21-6-14-27(37)15-7-21)29(38)33-26-16-17-36(2,20-26)19-22-4-10-24(32)11-5-22/h4-15,26,28H,3,16-20H2,1-2H3,(H3-,33,34,35,37,38,39,40)/p+1/t26-,28-,36?/m0/s1
n/an/a 39.8n/an/an/an/an/an/a
GlaxoSmithKline
Curated by ChEMBL
Assay Description
Antagonist activity at human recombinant muscarinic M2 receptor expressed in CHO cells coexpressing chimeric G protein Gqi5 assessed as inhibition of...
Bioorg Med Chem Lett 18: 5481-6 (2008)
Article DOI: 10.1016/j.bmcl.2008.09.020
BindingDB Entry DOI: 10.7270/Q23B61CM
Muscarinic acetylcholine receptor M3
(Homo sapiens (Human))
BDBM50413104
(CHEMBL540144)
Show SMILES CCOC(=O)c1ccc(NC(=O)N[C@@H](Cc2ccc(O)cc2)C(=O)N[C@H]2CC[N+](C)(Cc3ccc(F)cc3)C2)cc1 |r|
Show InChI InChI=1S/C31H35FN4O5/c1-3-41-30(39)23-8-12-25(13-9-23)34-31(40)35-28(18-21-6-14-27(37)15-7-21)29(38)33-26-16-17-36(2,20-26)19-22-4-10-24(32)11-5-22/h4-15,26,28H,3,16-20H2,1-2H3,(H3-,33,34,35,37,38,39,40)/p+1/t26-,28-,36?/m0/s1
Reactome pathway
n/an/a 6.31n/an/an/an/an/an/a
GlaxoSmithKline
Curated by ChEMBL
Assay Description
Antagonist activity at human recombinant muscarinic M3 receptor expressed in CHO cells assessed as inhibition of acetylcholine-induced intracellular ...
Bioorg Med Chem Lett 18: 5481-6 (2008)
Article DOI: 10.1016/j.bmcl.2008.09.020
BindingDB Entry DOI: 10.7270/Q23B61CM
Muscarinic acetylcholine receptor M1
(Homo sapiens (Human))
BDBM50413104
(CHEMBL540144)
Show SMILES CCOC(=O)c1ccc(NC(=O)N[C@@H](Cc2ccc(O)cc2)C(=O)N[C@H]2CC[N+](C)(Cc3ccc(F)cc3)C2)cc1 |r|
Show InChI InChI=1S/C31H35FN4O5/c1-3-41-30(39)23-8-12-25(13-9-23)34-31(40)35-28(18-21-6-14-27(37)15-7-21)29(38)33-26-16-17-36(2,20-26)19-22-4-10-24(32)11-5-22/h4-15,26,28H,3,16-20H2,1-2H3,(H3-,33,34,35,37,38,39,40)/p+1/t26-,28-,36?/m0/s1
n/an/a 200n/an/an/an/an/an/a
GlaxoSmithKline
Curated by ChEMBL
Assay Description
Antagonist activity at human recombinant muscarinic M1 receptor expressed in CHO cells assessed as inhibition of acetylcholine-induced intracellular ...
Bioorg Med Chem Lett 18: 5481-6 (2008)
Article DOI: 10.1016/j.bmcl.2008.09.020
BindingDB Entry DOI: 10.7270/Q23B61CM