BDBM50413297 CHEMBL473560
SMILES: Cc1cc(cc2c(Nc3cccc(c3)C#N)c(cnc12)C(N)=O)S(C)(=O)=O
InChI Key: InChIKey=RDLMWCSNDPDGNU-UHFFFAOYSA-N
Data: 1 IC50
Activity Spreadsheet -- Enzyme Inhibition Constant Data from BindingDB
Found 1 hit for monomerid = 50413297
Trg + Lig
Ki
nM
ΔG°
kcal/mole
IC50
nM
Kd
nM
EC50/IC50
nM
koff
s-1
kon
M-1s-1
pHTemp
°C
cAMP-specific 3',5'-cyclic phosphodiesterase 4B
(Homo sapiens (Human))
BDBM50413297
(CHEMBL473560)
Show SMILES Cc1cc(cc2c(Nc3cccc(c3)C#N)c(cnc12)C(N)=O)S(C)(=O)=O
Show InChI InChI=1S/C19H16N4O3S/c1-11-6-14(27(2,25)26)8-15-17(11)22-10-16(19(21)24)18(15)23-13-5-3-4-12(7-13)9-20/h3-8,10H,1-2H3,(H2,21,24)(H,22,23)
n/an/a 0.398n/an/an/an/an/an/a
GlaxoSmithKline Medicines Research Centre
Curated by ChEMBL
Assay Description
Inhibition of human recombinant PDE4B by scintillation proximity assay
Bioorg Med Chem Lett 19: 1380-5 (2009)
Article DOI: 10.1016/j.bmcl.2009.01.045
BindingDB Entry DOI: 10.7270/Q2FJ2J0J