BDBM50413495 CHEMBL483202
SMILES: NS(=O)(=O)c1cccc(CCCCCOCCCCCNC[C@H](O)c2ccc(O)c(CO)c2)c1
InChI Key: InChIKey=WBZQJNRPUIVYMF-VWLOTQADSA-N
Data: 3 EC50
Activity Spreadsheet -- Enzyme Inhibition Constant Data from BindingDB
Found 3 hits for monomerid = 50413495
Trg + Lig
Ki
nM
ΔG°
kcal/mole
IC50
nM
Kd
nM
EC50/IC50
nM
koff
s-1
kon
M-1s-1
pHTemp
°C
Beta-2 adrenergic receptor
(Homo sapiens (Human))
BDBM50413495
(CHEMBL483202)
Show SMILES NS(=O)(=O)c1cccc(CCCCCOCCCCCNC[C@H](O)c2ccc(O)c(CO)c2)c1 |r|
Show InChI InChI=1S/C25H38N2O6S/c26-34(31,32)23-10-7-9-20(16-23)8-3-1-5-14-33-15-6-2-4-13-27-18-25(30)21-11-12-24(29)22(17-21)19-28/h7,9-12,16-17,25,27-30H,1-6,8,13-15,18-19H2,(H2,26,31,32)/t25-/m0/s1
Reactome pathway
n/an/an/an/a 7.90n/an/an/an/a
GlaxoSmithKline Medicines Research Centre
Curated by ChEMBL
Assay Description
Agonist activity at human cloned beta2 adrenergic receptor expressed in CHO cells assessed as induction of intracellular cAMP accumulation by beta-ga...
J Med Chem 52: 2280-8 (2009)
Article DOI: 10.1021/jm801016j
BindingDB Entry DOI: 10.7270/Q2ST7R2P
Beta-1 adrenergic receptor
(Homo sapiens (Human))
BDBM50413495
(CHEMBL483202)
Show SMILES NS(=O)(=O)c1cccc(CCCCCOCCCCCNC[C@H](O)c2ccc(O)c(CO)c2)c1 |r|
Show InChI InChI=1S/C25H38N2O6S/c26-34(31,32)23-10-7-9-20(16-23)8-3-1-5-14-33-15-6-2-4-13-27-18-25(30)21-11-12-24(29)22(17-21)19-28/h7,9-12,16-17,25,27-30H,1-6,8,13-15,18-19H2,(H2,26,31,32)/t25-/m0/s1
Reactome pathway
n/an/an/an/a 1.26E+3n/an/an/an/a
GlaxoSmithKline Medicines Research Centre
Curated by ChEMBL
Assay Description
Agonist activity at human cloned beta-1 adrenergic receptor expressed in CHO cells assessed as induction of intracellular cAMP accumulation by beta-g...
J Med Chem 52: 2280-8 (2009)
Article DOI: 10.1021/jm801016j
BindingDB Entry DOI: 10.7270/Q2ST7R2P
Beta-3 adrenergic receptor
(Homo sapiens (Human))
BDBM50413495
(CHEMBL483202)
Show SMILES NS(=O)(=O)c1cccc(CCCCCOCCCCCNC[C@H](O)c2ccc(O)c(CO)c2)c1 |r|
Show InChI InChI=1S/C25H38N2O6S/c26-34(31,32)23-10-7-9-20(16-23)8-3-1-5-14-33-15-6-2-4-13-27-18-25(30)21-11-12-24(29)22(17-21)19-28/h7,9-12,16-17,25,27-30H,1-6,8,13-15,18-19H2,(H2,26,31,32)/t25-/m0/s1
Reactome pathway
n/an/an/an/a 2.51E+3n/an/an/an/a
GlaxoSmithKline Medicines Research Centre
Curated by ChEMBL
Assay Description
Agonist activity at human cloned beta3 adrenergic receptor expressed in CHO cells assessed as induction of intracellular cAMP accumulation by beta-ga...
J Med Chem 52: 2280-8 (2009)
Article DOI: 10.1021/jm801016j
BindingDB Entry DOI: 10.7270/Q2ST7R2P