BDBM50413647 CHEMBL443429
SMILES: CC(=O)NCCc1c[nH]c2ccc(cc12)[N+]([O-])=O
InChI Key: InChIKey=PKDUVHDAPLRJMS-UHFFFAOYSA-N
Data: 1 IC50
Activity Spreadsheet -- Enzyme Inhibition Constant Data from BindingDB
Found 1 hit for monomerid = 50413647
Trg + Lig
Ki
nM
ΔG°
kcal/mole
IC50
nM
Kd
nM
EC50/IC50
nM
koff
s-1
kon
M-1s-1
pHTemp
°C
Ribosyldihydronicotinamide dehydrogenase [quinone]
(Homo sapiens (Human))
BDBM50413647
(CHEMBL443429)
Show SMILES CC(=O)NCCc1c[nH]c2ccc(cc12)[N+]([O-])=O
Show InChI InChI=1S/C12H13N3O3/c1-8(16)13-5-4-9-7-14-12-3-2-10(15(17)18)6-11(9)12/h2-3,6-7,14H,4-5H2,1H3,(H,13,16)
n/an/a 41.7n/an/an/an/an/an/a
Lanzhou University
Curated by ChEMBL
Assay Description
Displacement of [125I]iodomelatonin from MT3/QR2 melatonin binding site expressed in CHO cells
Eur J Med Chem 43: 2861-9 (2008)
Article DOI: 10.1016/j.ejmech.2008.02.012
BindingDB Entry DOI: 10.7270/Q21C1Z31