BDBM50413652 CHEMBL457539
SMILES: COc1ccc2cccc(CCN3CCOC3=O)c2c1
InChI Key: InChIKey=DIWHNASBHNCGIW-UHFFFAOYSA-N
Data: 1 IC50
Activity Spreadsheet -- Enzyme Inhibition Constant Data from BindingDB
Found 1 hit for monomerid = 50413652
Trg + Lig
Ki
nM
ΔG°
kcal/mole
IC50
nM
Kd
nM
EC50/IC50
nM
koff
s-1
kon
M-1s-1
pHTemp
°C
Ribosyldihydronicotinamide dehydrogenase [quinone]
(Homo sapiens (Human))
BDBM50413652
(CHEMBL457539)
Show SMILES COc1ccc2cccc(CCN3CCOC3=O)c2c1
Show InChI InChI=1S/C16H17NO3/c1-19-14-6-5-12-3-2-4-13(15(12)11-14)7-8-17-9-10-20-16(17)18/h2-6,11H,7-10H2,1H3
n/an/a 14.1n/an/an/an/an/an/a
Lanzhou University
Curated by ChEMBL
Assay Description
Displacement of [125I]iodomelatonin from MT3/QR2 melatonin binding site expressed in CHO cells
Eur J Med Chem 43: 2861-9 (2008)
Article DOI: 10.1016/j.ejmech.2008.02.012
BindingDB Entry DOI: 10.7270/Q21C1Z31