null
SMILES: [O-]C(=O)c1cccc(c1)-c1cc(Cl)ccc1-c1cc(Cl)ccc1OCc1ccccc1
InChI Key: InChIKey=DRLVXCRSROSNIE-UHFFFAOYSA-M
Activity Spreadsheet -- Enzyme Inhibition Constant Data from BindingDB
Found 1 hit for monomerid = 50413680
Trg + Lig
Ki
nM
ΔG°
kcal/mole
IC50
nM
Kd
nM
EC50/IC50
nM
koff
s-1
kon
M-1s-1
pHTemp
°C
Prostaglandin E2 receptor EP1 subtype
(Homo sapiens (Human))
BDBM50413680
(CHEMBL456706)
Show SMILES [O-]C(=O)c1cccc(c1)-c1cc(Cl)ccc1-c1cc(Cl)ccc1OCc1ccccc1
Show InChI InChI=1S/C26H18Cl2O3/c27-20-9-11-22(23(14-20)18-7-4-8-19(13-18)26(29)30)24-15-21(28)10-12-25(24)31-16-17-5-2-1-3-6-17/h1-15H,16H2,(H,29,30)/p-1
n/an/a>1.00E+3n/an/an/an/an/an/a
GlaxoSmithKline
Curated by ChEMBL
Assay Description
Binding affinity to EP1 receptor
Bioorg Med Chem Lett 19: 497-501 (2008)
Article DOI: 10.1016/j.bmcl.2008.11.032
BindingDB Entry DOI: 10.7270/Q2N879N5