BDBM50413779 CHEMBL500458
SMILES: [#6]-[#16]-[#6]-[#6]-[#6@H](-[#7]-[#6](=O)-[#6]-[#7]-[#6](=O)-[#6@@H](-[#7]-[#6](=O)-[#6]-[#7]-[#6](=O)-[#6@@H](-[#7]-[#6](=O)-[#6@H](-[#7]-[#6](=O)-[#6@H](-[#6]-[#6](-[#7])=O)-[#7]-[#6](=O)-[#6@H](-[#6]-[#6]-[#6]\[#7]=[#6](/[#7])-[#7])-[#7]-[#6](=O)-[#6@H](-[#6]-c1ccccc1)-[#7]-[#6](=O)-[#6@@H](-[#7])-[#6]-[#8])-c1ccccc1)-[#6](-[#6])-[#6])-[#6@@H](-[#6])-[#8])-[#6](=O)-[#7]-[#6@@H](-[#6]-[#6]-[#6]-[#6]-[#7])-[#6](=O)-[#7]-[#6@@H](-[#6]-[#6]-[#6]-[#6]-[#7])-[#6](=O)-[#7]-[#6@@H](-[#6@@H](-[#6])-[#8])-[#6](=O)-[#7]-[#6@@H](-[#6]-[#8])-[#6](=O)-[#7]-[#6@@H](-[#6]-c1ccccc1)-[#6](=O)-[#7]-[#6@@H](-[#6]-[#6]-[#6](-[#7])=O)-[#6](=O)-[#7]-[#6@@H](-[#6]-[#6]-[#6]\[#7]=[#6](/[#7])-[#7])-[#6](=O)-[#7]-[#6@@H](-[#6])-[#6](=O)-[#7]-[#6@@H](-[#6]-[#6]-[#6]-[#6]-[#7])-[#6](-[#8])=O
InChI Key: InChIKey=BXNFEIDLCTUCDO-IZJOZHIMSA-N
Data: 1 EC50
Activity Spreadsheet -- Enzyme Inhibition Constant Data from BindingDB
Found 1 hit for monomerid = 50413779
Trg + Lig
Ki
nM
ΔG°
kcal/mole
IC50
nM
Kd
nM
EC50/IC50
nM
koff
s-1
kon
M-1s-1
pHTemp
°C
Neuropeptide S receptor
(Mus musculus)
BDBM50413779
(CHEMBL500458)
Show SMILES [#6]-[#16]-[#6]-[#6]-[#6@H](-[#7]-[#6](=O)-[#6]-[#7]-[#6](=O)-[#6@@H](-[#7]-[#6](=O)-[#6]-[#7]-[#6](=O)-[#6@@H](-[#7]-[#6](=O)-[#6@H](-[#7]-[#6](=O)-[#6@H](-[#6]-[#6](-[#7])=O)-[#7]-[#6](=O)-[#6@H](-[#6]-[#6]-[#6]\[#7]=[#6](/[#7])-[#7])-[#7]-[#6](=O)-[#6@H](-[#6]-c1ccccc1)-[#7]-[#6](=O)-[#6@@H](-[#7])-[#6]-[#8])-c1ccccc1)-[#6](-[#6])-[#6])-[#6@@H](-[#6])-[#8])-[#6](=O)-[#7]-[#6@@H](-[#6]-[#6]-[#6]-[#6]-[#7])-[#6](=O)-[#7]-[#6@@H](-[#6]-[#6]-[#6]-[#6]-[#7])-[#6](=O)-[#7]-[#6@@H](-[#6@@H](-[#6])-[#8])-[#6](=O)-[#7]-[#6@@H](-[#6]-[#8])-[#6](=O)-[#7]-[#6@@H](-[#6]-c1ccccc1)-[#6](=O)-[#7]-[#6@@H](-[#6]-[#6]-[#6](-[#7])=O)-[#6](=O)-[#7]-[#6@@H](-[#6]-[#6]-[#6]\[#7]=[#6](/[#7])-[#7])-[#6](=O)-[#7]-[#6@@H](-[#6])-[#6](=O)-[#7]-[#6@@H](-[#6]-[#6]-[#6]-[#6]-[#7])-[#6](-[#8])=O |r|
Show InChI InChI=1S/C96H154N30O26S/c1-51(2)74(124-93(150)77(57-28-14-9-15-29-57)126-88(145)68(46-71(102)132)121-82(139)62(34-23-42-108-96(105)106)116-86(143)66(119-79(136)58(100)49-127)44-55-24-10-7-11-25-55)90(147)109-48-73(134)123-75(53(4)129)91(148)110-47-72(133)112-64(37-43-153-6)84(141)113-59(30-16-19-38-97)81(138)114-60(31-17-20-39-98)85(142)125-76(54(5)130)92(149)122-69(50-128)89(146)120-67(45-56-26-12-8-13-27-56)87(144)117-63(35-36-70(101)131)83(140)115-61(33-22-41-107-95(103)104)80(137)111-52(3)78(135)118-65(94(151)152)32-18-21-40-99/h7-15,24-29,51-54,58-69,74-77,127-130H,16-23,30-50,97-100H2,1-6H3,(H2,101,131)(H2,102,132)(H,109,147)(H,110,148)(H,111,137)(H,112,133)(H,113,141)(H,114,138)(H,115,140)(H,116,143)(H,117,144)(H,118,135)(H,119,136)(H,120,146)(H,121,139)(H,122,149)(H,123,134)(H,124,150)(H,125,142)(H,126,145)(H,151,152)(H4,103,104,107)(H4,105,106,108)/t52-,53+,54+,58-,59-,60-,61-,62-,63-,64-,65-,66-,67-,68-,69-,74-,75-,76-,77+/m0/s1
Reactome pathway
n/an/an/an/a 661n/an/an/an/a
National Institute of Neuroscienc
Curated by ChEMBL
Assay Description
Agonist activity at mouse NPSR expressed in HEK293 cells by calcium mobilization assay
J Med Chem 52: 4068-71 (2009)
Article DOI: 10.1021/jm900604g
BindingDB Entry DOI: 10.7270/Q2445NQD