null
SMILES: C[C@@H](NCc1ccccc1)C(=O)Nc1c(C)cccc1C
InChI Key: InChIKey=OLRWXLIJPOFTKY-OAHLLOKOSA-N
Activity Spreadsheet -- Enzyme Inhibition Constant Data from BindingDB
Found 1 hit for monomerid = 50413841
Trg + Lig
Ki
nM
ΔG°
kcal/mole
IC50
nM
Kd
nM
EC50/IC50
nM
koff
s-1
kon
M-1s-1
pHTemp
°C
Sodium channel protein type 4 subunit alpha
(Homo sapiens (Human))
BDBM50413841
(CHEMBL472884)
Show SMILES C[C@@H](NCc1ccccc1)C(=O)Nc1c(C)cccc1C |r|
Show InChI InChI=1S/C18H22N2O/c1-13-8-7-9-14(2)17(13)20-18(21)15(3)19-12-16-10-5-4-6-11-16/h4-11,15,19H,12H2,1-3H3,(H,20,21)/t15-/m1/s1
n/an/an/an/a 1.12E+4n/an/an/an/a
Universit£ degli Studi di Bari
Curated by ChEMBL
Assay Description
Inhibition of Nav1.4 ion channel assessed as reduction in cumulative sodium current
Eur J Med Chem 44: 1477-85 (2009)
Article DOI: 10.1016/j.ejmech.2008.10.005
BindingDB Entry DOI: 10.7270/Q2M61MGC