null
SMILES: [#6]-[#6](-[#6])-[#6]-1-[#7]-[#6](=O)-[#6](-[#6]-c2ccccc2)-[#7]-[#6](=O)-[#6](-[#6]-c2ccc(-[#8])cc2)-[#7]-[#6](=O)-[#6]C2([#6]-[#6]-[#6]-[#6]-[#6]2)[#16]-[#16]-[#6]-[#6](-[#7]-[#6](=O)-[#6](-[#6]-[#6](-[#7])=O)-[#7]-[#6]-1=O)-[#6](=O)-[#7]-1-[#6]-[#6]-[#6]-[#6]-1-[#6](=O)-[#7]-[#6](-[#6]-[#6]-[#6]\[#7]=[#6](/[#7])-[#7])-[#6](=O)-[#7]-[#6]-[#6](-[#7])=O
InChI Key: InChIKey=FTPKAQCWQHOBMR-UHFFFAOYSA-N
Activity Spreadsheet -- Enzyme Inhibition Constant Data from BindingDB
Found 2 hits for monomerid = 50414477
Trg + Lig
Ki
nM
ΔG°
kcal/mole
IC50
nM
Kd
nM
EC50/IC50
nM
koff
s-1
kon
M-1s-1
pHTemp
°C
Vasopressin V1a receptor
(RAT)
BDBM50414477
(CHEMBL553710)
Show SMILES [#6]-[#6](-[#6])-[#6]-1-[#7]-[#6](=O)-[#6](-[#6]-c2ccccc2)-[#7]-[#6](=O)-[#6](-[#6]-c2ccc(-[#8])cc2)-[#7]-[#6](=O)-[#6]C2([#6]-[#6]-[#6]-[#6]-[#6]2)[#16]-[#16]-[#6]-[#6](-[#7]-[#6](=O)-[#6](-[#6]-[#6](-[#7])=O)-[#7]-[#6]-1=O)-[#6](=O)-[#7]-1-[#6]-[#6]-[#6]-[#6]-1-[#6](=O)-[#7]-[#6](-[#6]-[#6]-[#6]\[#7]=[#6](/[#7])-[#7])-[#6](=O)-[#7]-[#6]-[#6](-[#7])=O
Show InChI InChI=1S/C51H73N13O11S2/c1-29(2)42-48(74)61-36(25-39(52)66)45(71)62-37(49(75)64-22-10-14-38(64)47(73)59-33(13-9-21-56-50(54)55)43(69)57-27-40(53)67)28-76-77-51(19-7-4-8-20-51)26-41(68)58-34(24-31-15-17-32(65)18-16-31)44(70)60-35(46(72)63-42)23-30-11-5-3-6-12-30/h3,5-6,11-12,15-18,29,33-38,42,65H,4,7-10,13-14,19-28H2,1-2H3,(H2,52,66)(H2,53,67)(H,57,69)(H,58,68)(H,59,73)(H,60,70)(H,61,74)(H,62,71)(H,63,72)(H4,54,55,56)
n/an/an/a 4.47n/an/an/an/an/a
University of Gdansk
Curated by ChEMBL
Assay Description
Antagonist activity at vasopressin V1a receptor in phenoxybenzamine-treated Wistar rat uterus assessed as inhibition of vasopressin-induced arteial v...
Eur J Med Chem 44: 2862-67 (2009)
BindingDB Entry DOI: 10.7270/Q28P61RJ
Oxytocin receptor
(RAT)
BDBM50414477
(CHEMBL553710)
Show SMILES [#6]-[#6](-[#6])-[#6]-1-[#7]-[#6](=O)-[#6](-[#6]-c2ccccc2)-[#7]-[#6](=O)-[#6](-[#6]-c2ccc(-[#8])cc2)-[#7]-[#6](=O)-[#6]C2([#6]-[#6]-[#6]-[#6]-[#6]2)[#16]-[#16]-[#6]-[#6](-[#7]-[#6](=O)-[#6](-[#6]-[#6](-[#7])=O)-[#7]-[#6]-1=O)-[#6](=O)-[#7]-1-[#6]-[#6]-[#6]-[#6]-1-[#6](=O)-[#7]-[#6](-[#6]-[#6]-[#6]\[#7]=[#6](/[#7])-[#7])-[#6](=O)-[#7]-[#6]-[#6](-[#7])=O
Show InChI InChI=1S/C51H73N13O11S2/c1-29(2)42-48(74)61-36(25-39(52)66)45(71)62-37(49(75)64-22-10-14-38(64)47(73)59-33(13-9-21-56-50(54)55)43(69)57-27-40(53)67)28-76-77-51(19-7-4-8-20-51)26-41(68)58-34(24-31-15-17-32(65)18-16-31)44(70)60-35(46(72)63-42)23-30-11-5-3-6-12-30/h3,5-6,11-12,15-18,29,33-38,42,65H,4,7-10,13-14,19-28H2,1-2H3,(H2,52,66)(H2,53,67)(H,57,69)(H,58,68)(H,59,73)(H,60,70)(H,61,74)(H,62,71)(H,63,72)(H4,54,55,56)
Reactome pathway
n/an/an/a 7.08n/an/an/an/an/a
University of Gdansk
Curated by ChEMBL
Assay Description
Antagonist activity at oxytocin receptor in Wistar rat uterus assessed as inhibition of oxytocin-induced uterotonic activity treated 1 min prior to o...
Eur J Med Chem 44: 2862-67 (2009)
BindingDB Entry DOI: 10.7270/Q28P61RJ