BDBM50414503 CHEMBL553912
SMILES: CCCCCCN(CCCCCC)c1cc(n[nH]1)C(O)=O
InChI Key: InChIKey=KREBUSYHTIBYKI-UHFFFAOYSA-N
Data: 2 EC50
Activity Spreadsheet -- Enzyme Inhibition Constant Data from BindingDB
Found 2 hits for monomerid = 50414503
Trg + Lig
Ki
nM
ΔG°
kcal/mole
IC50
nM
Kd
nM
EC50/IC50
nM
koff
s-1
kon
M-1s-1
pHTemp
°C
Hydroxycarboxylic acid receptor 2
(Homo sapiens (Human))
BDBM50414503
(CHEMBL553912)
Show SMILES CCCCCCN(CCCCCC)c1cc(n[nH]1)C(O)=O
Show InChI InChI=1S/C16H29N3O2/c1-3-5-7-9-11-19(12-10-8-6-4-2)15-13-14(16(20)21)17-18-15/h13H,3-12H2,1-2H3,(H,17,18)(H,20,21)
Reactome pathway
n/an/an/an/a<1.00E+4n/an/an/an/a
Arena Pharmaceuticals
Curated by ChEMBL
Assay Description
Agonist activity at GPR109a receptor transfected in CHOK1 cells assessed as inhibition of forskolin-induced cAMP generation by HTRF assay
Bioorg Med Chem Lett 19: 4207-9 (2009)
Article DOI: 10.1016/j.bmcl.2009.05.108
BindingDB Entry DOI: 10.7270/Q2GF0TJJ
HM74 nicotinic acid GPCR
(Homo sapiens (Human))
BDBM50414503
(CHEMBL553912)
Show SMILES CCCCCCN(CCCCCC)c1cc(n[nH]1)C(O)=O
Show InChI InChI=1S/C16H29N3O2/c1-3-5-7-9-11-19(12-10-8-6-4-2)15-13-14(16(20)21)17-18-15/h13H,3-12H2,1-2H3,(H,17,18)(H,20,21)
n/an/an/an/a<1.00E+4n/an/an/an/a
Arena Pharmaceuticals
Curated by ChEMBL
Assay Description
Agonist activity at GPR109b receptor transfected in CHOK1 cells assessed as inhibition of forskolin-induced cAMP generation by HTRF assay
Bioorg Med Chem Lett 19: 4207-9 (2009)
Article DOI: 10.1016/j.bmcl.2009.05.108
BindingDB Entry DOI: 10.7270/Q2GF0TJJ