BDBM50414574 CHEMBL563580
SMILES: Clc1cccc(c1)N1CCN(CCN2[C@H]3CC[C@@H]2CCC3)C1=O
InChI Key: InChIKey=VXTVAYBBRGJBTM-IYBDPMFKSA-N
Data: 4 KI  2 IC50
Activity Spreadsheet -- Enzyme Inhibition Constant Data from BindingDB
Found 6 hits for monomerid = 50414574
Trg + Lig
Ki
nM
ΔG°
kcal/mole
IC50
nM
Kd
nM
EC50/IC50
nM
koff
s-1
kon
M-1s-1
pHTemp
°C
D(3) dopamine receptor
(Homo sapiens (Human))
BDBM50414574
(CHEMBL563580)
Show SMILES Clc1cccc(c1)N1CCN(CCN2[C@H]3CC[C@@H]2CCC3)C1=O |r,TLB:12:13:19.18.20:16.15|
Show InChI InChI=1S/C18H24ClN3O/c19-14-3-1-6-17(13-14)22-12-10-20(18(22)23)9-11-21-15-4-2-5-16(21)8-7-15/h1,3,6,13,15-16H,2,4-5,7-12H2/t15-,16+
1.26n/an/an/an/an/an/an/an/a
Imperial College London
Curated by ChEMBL
Assay Description
Binding affinity to human DRD3 receptor by GTPgammaS binding assay
Bioorg Med Chem Lett 19: 5056-9 (2009)
Article DOI: 10.1016/j.bmcl.2009.07.055
BindingDB Entry DOI: 10.7270/Q2PR7X7C
D(3) dopamine receptor
(Homo sapiens (Human))
BDBM50414574
(CHEMBL563580)
Show SMILES Clc1cccc(c1)N1CCN(CCN2[C@H]3CC[C@@H]2CCC3)C1=O |r,TLB:12:13:19.18.20:16.15|
Show InChI InChI=1S/C18H24ClN3O/c19-14-3-1-6-17(13-14)22-12-10-20(18(22)23)9-11-21-15-4-2-5-16(21)8-7-15/h1,3,6,13,15-16H,2,4-5,7-12H2/t15-,16+
1.26n/an/an/an/an/an/an/an/a
Cancer Therapeutics
Curated by ChEMBL
Assay Description
Antagonist activity at human D3 receptor expressed in CHO cells by [35S]GTPgammaS binding assay
Bioorg Med Chem Lett 19: 4799-801 (2009)
Article DOI: 10.1016/j.bmcl.2009.06.043
BindingDB Entry DOI: 10.7270/Q2154J9T
D(2) dopamine receptor
(Homo sapiens (Human))
BDBM50414574
(CHEMBL563580)
Show SMILES Clc1cccc(c1)N1CCN(CCN2[C@H]3CC[C@@H]2CCC3)C1=O |r,TLB:12:13:19.18.20:16.15|
Show InChI InChI=1S/C18H24ClN3O/c19-14-3-1-6-17(13-14)22-12-10-20(18(22)23)9-11-21-15-4-2-5-16(21)8-7-15/h1,3,6,13,15-16H,2,4-5,7-12H2/t15-,16+
Reactome pathway
5.01n/an/an/an/an/an/an/an/a
Cancer Therapeutics
Curated by ChEMBL
Assay Description
Antagonist activity at human D2 receptor expressed in CHO cells by [35S]GTPgammaS binding assay
Bioorg Med Chem Lett 19: 4799-801 (2009)
Article DOI: 10.1016/j.bmcl.2009.06.043
BindingDB Entry DOI: 10.7270/Q2154J9T
D(2) dopamine receptor
(Homo sapiens (Human))
BDBM50414574
(CHEMBL563580)
Show SMILES Clc1cccc(c1)N1CCN(CCN2[C@H]3CC[C@@H]2CCC3)C1=O |r,TLB:12:13:19.18.20:16.15|
Show InChI InChI=1S/C18H24ClN3O/c19-14-3-1-6-17(13-14)22-12-10-20(18(22)23)9-11-21-15-4-2-5-16(21)8-7-15/h1,3,6,13,15-16H,2,4-5,7-12H2/t15-,16+
Reactome pathway
5.01n/an/an/an/an/an/an/an/a
Imperial College London
Curated by ChEMBL
Assay Description
Binding affinity to human DRD2 receptor by GTPgammaS binding assay
Bioorg Med Chem Lett 19: 5056-9 (2009)
Article DOI: 10.1016/j.bmcl.2009.07.055
BindingDB Entry DOI: 10.7270/Q2PR7X7C
Potassium voltage-gated channel subfamily H member 2
(Homo sapiens (Human))
BDBM50414574
(CHEMBL563580)
Show SMILES Clc1cccc(c1)N1CCN(CCN2[C@H]3CC[C@@H]2CCC3)C1=O |r,TLB:12:13:19.18.20:16.15|
Show InChI InChI=1S/C18H24ClN3O/c19-14-3-1-6-17(13-14)22-12-10-20(18(22)23)9-11-21-15-4-2-5-16(21)8-7-15/h1,3,6,13,15-16H,2,4-5,7-12H2/t15-,16+
Reactome pathway
n/an/a 1.58E+3n/an/an/an/an/an/a
Imperial College London
Curated by ChEMBL
Assay Description
Displacement of [3H]dofetilide from human ERG
Bioorg Med Chem Lett 19: 5056-9 (2009)
Article DOI: 10.1016/j.bmcl.2009.07.055
BindingDB Entry DOI: 10.7270/Q2PR7X7C
Potassium voltage-gated channel subfamily H member 2
(Homo sapiens (Human))
BDBM50414574
(CHEMBL563580)
Show SMILES Clc1cccc(c1)N1CCN(CCN2[C@H]3CC[C@@H]2CCC3)C1=O |r,TLB:12:13:19.18.20:16.15|
Show InChI InChI=1S/C18H24ClN3O/c19-14-3-1-6-17(13-14)22-12-10-20(18(22)23)9-11-21-15-4-2-5-16(21)8-7-15/h1,3,6,13,15-16H,2,4-5,7-12H2/t15-,16+
Reactome pathway
n/an/a 1.58E+3n/an/an/an/an/an/a
Cancer Therapeutics
Curated by ChEMBL
Assay Description
Displacement of [3H]dofetilide from human ERG channel by scintillation proximity assay
Bioorg Med Chem Lett 19: 4799-801 (2009)
Article DOI: 10.1016/j.bmcl.2009.06.043
BindingDB Entry DOI: 10.7270/Q2154J9T