null
SMILES: CCN(CC(O)(CNc1cc(C)cc2n(ncc12)-c1ccccc1)C(F)(F)F)C(=O)c1ccccc1F
InChI Key: InChIKey=WNBKWJAHPXPPPM-UHFFFAOYSA-N
Activity Spreadsheet -- Enzyme Inhibition Constant Data from BindingDB
Found 1 hit for monomerid = 50414611
Trg + Lig
Ki
nM
ΔG°
kcal/mole
IC50
nM
Kd
nM
EC50/IC50
nM
koff
s-1
kon
M-1s-1
pHTemp
°C
Glucocorticoid receptor
(Homo sapiens (Human))
BDBM50414611
(CHEMBL560797)
Show SMILES CCN(CC(O)(CNc1cc(C)cc2n(ncc12)-c1ccccc1)C(F)(F)F)C(=O)c1ccccc1F
Show InChI InChI=1S/C27H26F4N4O2/c1-3-34(25(36)20-11-7-8-12-22(20)28)17-26(37,27(29,30)31)16-32-23-13-18(2)14-24-21(23)15-33-35(24)19-9-5-4-6-10-19/h4-15,32,37H,3,16-17H2,1-2H3
n/an/a 0.251n/an/an/an/an/an/a
GlaxoSmithKline
Curated by ChEMBL
Assay Description
Agonist activity at GR in human A549 cells by NF-kappaB transrepression assay
Bioorg Med Chem Lett 19: 4846-50 (2009)
Article DOI: 10.1016/j.bmcl.2009.06.020
BindingDB Entry DOI: 10.7270/Q2RR20HH