BDBM50414626 CHEMBL556504
SMILES: O=C(NCC#N)C(Cc1cccc(c1)-c1ccncc1)NC(=O)c1ccccc1
InChI Key: InChIKey=STJLGGUWJOEIHR-UHFFFAOYSA-N
Data: 5 IC50
Activity Spreadsheet -- Enzyme Inhibition Constant Data from BindingDB
Found 5 hits for monomerid = 50414626
Trg + Lig
Ki
nM
ΔG°
kcal/mole
IC50
nM
Kd
nM
EC50/IC50
nM
koff
s-1
kon
M-1s-1
pHTemp
°C
Procathepsin L
(Homo sapiens (Human))
BDBM50414626
(CHEMBL556504)
Show SMILES O=C(NCC#N)C(Cc1cccc(c1)-c1ccncc1)NC(=O)c1ccccc1
Show InChI InChI=1S/C23H20N4O2/c24-11-14-26-23(29)21(27-22(28)19-6-2-1-3-7-19)16-17-5-4-8-20(15-17)18-9-12-25-13-10-18/h1-10,12-13,15,21H,14,16H2,(H,26,29)(H,27,28)
Reactome pathway
n/an/a 1.58E+3n/an/an/an/an/an/a
AstraZeneca
Curated by ChEMBL
Assay Description
Inhibition of cathepsin L assessed as inhibition of fluorogenic substrate cleavage
Bioorg Med Chem Lett 19: 4622-5 (2009)
Article DOI: 10.1016/j.bmcl.2009.06.090
BindingDB Entry DOI: 10.7270/Q2N017S3
Cathepsin L2
(Homo sapiens (Human))
BDBM50414626
(CHEMBL556504)
Show SMILES O=C(NCC#N)C(Cc1cccc(c1)-c1ccncc1)NC(=O)c1ccccc1
Show InChI InChI=1S/C23H20N4O2/c24-11-14-26-23(29)21(27-22(28)19-6-2-1-3-7-19)16-17-5-4-8-20(15-17)18-9-12-25-13-10-18/h1-10,12-13,15,21H,14,16H2,(H,26,29)(H,27,28)
n/an/a 3.16E+3n/an/an/an/an/an/a
AstraZeneca
Curated by ChEMBL
Assay Description
Inhibition of cathepsin L2 assessed as inhibition of fluorogenic substrate cleavage
Bioorg Med Chem Lett 19: 4622-5 (2009)
Article DOI: 10.1016/j.bmcl.2009.06.090
BindingDB Entry DOI: 10.7270/Q2N017S3
Cathepsin S
(Homo sapiens (Human))
BDBM50414626
(CHEMBL556504)
Show SMILES O=C(NCC#N)C(Cc1cccc(c1)-c1ccncc1)NC(=O)c1ccccc1
Show InChI InChI=1S/C23H20N4O2/c24-11-14-26-23(29)21(27-22(28)19-6-2-1-3-7-19)16-17-5-4-8-20(15-17)18-9-12-25-13-10-18/h1-10,12-13,15,21H,14,16H2,(H,26,29)(H,27,28)
Reactome pathway
n/an/a 251n/an/an/an/an/an/a
AstraZeneca
Curated by ChEMBL
Assay Description
Inhibition of cathepsin S assessed as inhibition of fluorogenic substrate cleavage
Bioorg Med Chem Lett 19: 4622-5 (2009)
Article DOI: 10.1016/j.bmcl.2009.06.090
BindingDB Entry DOI: 10.7270/Q2N017S3
Cathepsin K
(Homo sapiens (Human))
BDBM50414626
(CHEMBL556504)
Show SMILES O=C(NCC#N)C(Cc1cccc(c1)-c1ccncc1)NC(=O)c1ccccc1
Show InChI InChI=1S/C23H20N4O2/c24-11-14-26-23(29)21(27-22(28)19-6-2-1-3-7-19)16-17-5-4-8-20(15-17)18-9-12-25-13-10-18/h1-10,12-13,15,21H,14,16H2,(H,26,29)(H,27,28)
Reactome pathway
n/an/a>1.00E+4n/an/an/an/an/an/a
AstraZeneca
Curated by ChEMBL
Assay Description
Inhibition of cathepsin K assessed as inhibition of fluorogenic substrate cleavage
Bioorg Med Chem Lett 19: 4622-5 (2009)
Article DOI: 10.1016/j.bmcl.2009.06.090
BindingDB Entry DOI: 10.7270/Q2N017S3
Cathepsin B
(Homo sapiens (Human))
BDBM50414626
(CHEMBL556504)
Show SMILES O=C(NCC#N)C(Cc1cccc(c1)-c1ccncc1)NC(=O)c1ccccc1
Show InChI InChI=1S/C23H20N4O2/c24-11-14-26-23(29)21(27-22(28)19-6-2-1-3-7-19)16-17-5-4-8-20(15-17)18-9-12-25-13-10-18/h1-10,12-13,15,21H,14,16H2,(H,26,29)(H,27,28)
Reactome pathway
n/an/a>1.00E+4n/an/an/an/an/an/a
AstraZeneca
Curated by ChEMBL
Assay Description
Inhibition of human liver cathepsin B assessed as inhibition of fluorogenic substrate cleavage
Bioorg Med Chem Lett 19: 4622-5 (2009)
Article DOI: 10.1016/j.bmcl.2009.06.090
BindingDB Entry DOI: 10.7270/Q2N017S3