BDBM50414630 CHEMBL561802
SMILES: O=C(NCC#N)C(Cc1cccc(c1)-c1cn[nH]c1)NC(=O)c1ccccc1
InChI Key: InChIKey=LHNTYJBNWWBALU-UHFFFAOYSA-N
Data: 5 IC50
Activity Spreadsheet -- Enzyme Inhibition Constant Data from BindingDB
Found 5 hits for monomerid = 50414630
Trg + Lig
Ki
nM
ΔG°
kcal/mole
IC50
nM
Kd
nM
EC50/IC50
nM
koff
s-1
kon
M-1s-1
pHTemp
°C
Procathepsin L
(Homo sapiens (Human))
BDBM50414630
(CHEMBL561802)
Show SMILES O=C(NCC#N)C(Cc1cccc(c1)-c1cn[nH]c1)NC(=O)c1ccccc1
Show InChI InChI=1S/C21H19N5O2/c22-9-10-23-21(28)19(26-20(27)16-6-2-1-3-7-16)12-15-5-4-8-17(11-15)18-13-24-25-14-18/h1-8,11,13-14,19H,10,12H2,(H,23,28)(H,24,25)(H,26,27)
Reactome pathway
n/an/a 794n/an/an/an/an/an/a
AstraZeneca
Curated by ChEMBL
Assay Description
Inhibition of cathepsin L assessed as inhibition of fluorogenic substrate cleavage
Bioorg Med Chem Lett 19: 4622-5 (2009)
Article DOI: 10.1016/j.bmcl.2009.06.090
BindingDB Entry DOI: 10.7270/Q2N017S3
Cathepsin L2
(Homo sapiens (Human))
BDBM50414630
(CHEMBL561802)
Show SMILES O=C(NCC#N)C(Cc1cccc(c1)-c1cn[nH]c1)NC(=O)c1ccccc1
Show InChI InChI=1S/C21H19N5O2/c22-9-10-23-21(28)19(26-20(27)16-6-2-1-3-7-16)12-15-5-4-8-17(11-15)18-13-24-25-14-18/h1-8,11,13-14,19H,10,12H2,(H,23,28)(H,24,25)(H,26,27)
n/an/a 1.58E+3n/an/an/an/an/an/a
AstraZeneca
Curated by ChEMBL
Assay Description
Inhibition of cathepsin L2 assessed as inhibition of fluorogenic substrate cleavage
Bioorg Med Chem Lett 19: 4622-5 (2009)
Article DOI: 10.1016/j.bmcl.2009.06.090
BindingDB Entry DOI: 10.7270/Q2N017S3
Cathepsin S
(Homo sapiens (Human))
BDBM50414630
(CHEMBL561802)
Show SMILES O=C(NCC#N)C(Cc1cccc(c1)-c1cn[nH]c1)NC(=O)c1ccccc1
Show InChI InChI=1S/C21H19N5O2/c22-9-10-23-21(28)19(26-20(27)16-6-2-1-3-7-16)12-15-5-4-8-17(11-15)18-13-24-25-14-18/h1-8,11,13-14,19H,10,12H2,(H,23,28)(H,24,25)(H,26,27)
Reactome pathway
n/an/a 79.4n/an/an/an/an/an/a
AstraZeneca
Curated by ChEMBL
Assay Description
Inhibition of cathepsin S assessed as inhibition of fluorogenic substrate cleavage
Bioorg Med Chem Lett 19: 4622-5 (2009)
Article DOI: 10.1016/j.bmcl.2009.06.090
BindingDB Entry DOI: 10.7270/Q2N017S3
Cathepsin K
(Homo sapiens (Human))
BDBM50414630
(CHEMBL561802)
Show SMILES O=C(NCC#N)C(Cc1cccc(c1)-c1cn[nH]c1)NC(=O)c1ccccc1
Show InChI InChI=1S/C21H19N5O2/c22-9-10-23-21(28)19(26-20(27)16-6-2-1-3-7-16)12-15-5-4-8-17(11-15)18-13-24-25-14-18/h1-8,11,13-14,19H,10,12H2,(H,23,28)(H,24,25)(H,26,27)
Reactome pathway
n/an/a>1.00E+4n/an/an/an/an/an/a
AstraZeneca
Curated by ChEMBL
Assay Description
Inhibition of cathepsin K assessed as inhibition of fluorogenic substrate cleavage
Bioorg Med Chem Lett 19: 4622-5 (2009)
Article DOI: 10.1016/j.bmcl.2009.06.090
BindingDB Entry DOI: 10.7270/Q2N017S3
Cathepsin B
(Homo sapiens (Human))
BDBM50414630
(CHEMBL561802)
Show SMILES O=C(NCC#N)C(Cc1cccc(c1)-c1cn[nH]c1)NC(=O)c1ccccc1
Show InChI InChI=1S/C21H19N5O2/c22-9-10-23-21(28)19(26-20(27)16-6-2-1-3-7-16)12-15-5-4-8-17(11-15)18-13-24-25-14-18/h1-8,11,13-14,19H,10,12H2,(H,23,28)(H,24,25)(H,26,27)
Reactome pathway
n/an/a 7.94E+3n/an/an/an/an/an/a
AstraZeneca
Curated by ChEMBL
Assay Description
Inhibition of human liver cathepsin B assessed as inhibition of fluorogenic substrate cleavage
Bioorg Med Chem Lett 19: 4622-5 (2009)
Article DOI: 10.1016/j.bmcl.2009.06.090
BindingDB Entry DOI: 10.7270/Q2N017S3