BDBM50414657 CHEMBL562711
SMILES: CC(C)CC[C@@H](O)[C@](C)(O)[C@H]1CC[C@H]2[C@@H]3CC(=O)[C@H]4C[C@@H](O)[C@@H](O)C[C@]4(C)[C@H]3CC[C@]12C
InChI Key: InChIKey=UQTLRMAXXDCFFD-MUURXVJHSA-N
Data: 1 IC50
Activity Spreadsheet -- Enzyme Inhibition Constant Data from BindingDB
Found 1 hit for monomerid = 50414657
Trg + Lig
Ki
nM
ΔG°
kcal/mole
IC50
nM
Kd
nM
EC50/IC50
nM
koff
s-1
kon
M-1s-1
pHTemp
°C
Ecdysone receptor
(Drosophila melanogaster)
BDBM50414657
(CHEMBL562711)
Show SMILES CC(C)CC[C@@H](O)[C@](C)(O)[C@H]1CC[C@H]2[C@@H]3CC(=O)[C@H]4C[C@@H](O)[C@@H](O)C[C@]4(C)[C@H]3CC[C@]12C |r|
Show InChI InChI=1S/C27H46O5/c1-15(2)6-9-24(31)27(5,32)23-8-7-17-16-12-20(28)19-13-21(29)22(30)14-26(19,4)18(16)10-11-25(17,23)3/h15-19,21-24,29-32H,6-14H2,1-5H3/t16-,17-,18-,19+,21+,22-,23-,24+,25-,26+,27+/m0/s1
Reactome pathway
n/an/a 1.45E+4n/an/an/an/an/an/a
Kyoto University
Curated by ChEMBL
Assay Description
Binding affinity to ecdysone receptor ligand binding domain in Drosophila melanogaster assessed as number of hydrogen bonds formed
Bioorg Med Chem 17: 5868-73 (2009)
Article DOI: 10.1016/j.bmc.2009.07.011
BindingDB Entry DOI: 10.7270/Q2H70H2S