BDBM50414722 CHEMBL539713
SMILES: [H][C@]12CC[C@]([H])(C[C@@H](C1)NC(=O)c1cc3ccccc3n(C(C)C)c1=O)N2CCCCCCCN1CCC[C@H]1C(N)=O
InChI Key: InChIKey=WYNXEKYLFMUSEO-BVXNIFABSA-N
Data: 1 KI  1 EC50
Activity Spreadsheet -- Enzyme Inhibition Constant Data from BindingDB
Found 2 hits for monomerid = 50414722
Trg + Lig
Ki
nM
ΔG°
kcal/mole
IC50
nM
Kd
nM
EC50/IC50
nM
koff
s-1
kon
M-1s-1
pHTemp
°C
5-hydroxytryptamine receptor 4 (5-HT4)
(Homo sapiens (Human))
BDBM50414722
(CHEMBL539713)
Show SMILES [H][C@]12CC[C@]([H])(C[C@@H](C1)NC(=O)c1cc3ccccc3n(C(C)C)c1=O)N2CCCCCCCN1CCC[C@H]1C(N)=O |r|
Show InChI InChI=1S/C32H47N5O3/c1-22(2)37-28-12-7-6-11-23(28)19-27(32(37)40)31(39)34-24-20-25-14-15-26(21-24)36(25)18-9-5-3-4-8-16-35-17-10-13-29(35)30(33)38/h6-7,11-12,19,22,24-26,29H,3-5,8-10,13-18,20-21H2,1-2H3,(H2,33,38)(H,34,39)/t24-,25+,26-,29-/m0/s1
2n/an/an/an/an/an/an/an/a
Theravance, Inc.
Curated by ChEMBL
Assay Description
Displacement of [H]GR-113808 from human 5HT4C receptor expressed in HEK293 cells by liquid scintillation counting
J Med Chem 52: 5330-43 (2009)
Article DOI: 10.1021/jm900881j
BindingDB Entry DOI: 10.7270/Q2CF9RBH
5-hydroxytryptamine receptor 4 (5-HT4)
(Homo sapiens (Human))
BDBM50414722
(CHEMBL539713)
Show SMILES [H][C@]12CC[C@]([H])(C[C@@H](C1)NC(=O)c1cc3ccccc3n(C(C)C)c1=O)N2CCCCCCCN1CCC[C@H]1C(N)=O |r|
Show InChI InChI=1S/C32H47N5O3/c1-22(2)37-28-12-7-6-11-23(28)19-27(32(37)40)31(39)34-24-20-25-14-15-26(21-24)36(25)18-9-5-3-4-8-16-35-17-10-13-29(35)30(33)38/h6-7,11-12,19,22,24-26,29H,3-5,8-10,13-18,20-21H2,1-2H3,(H2,33,38)(H,34,39)/t24-,25+,26-,29-/m0/s1
n/an/an/an/a 0.398n/an/an/an/a
Theravance, Inc.
Curated by ChEMBL
Assay Description
Agonist activity at human 5HT4C receptor expressed in HEK293 cells assessed as acumulation of cAMP by flash plate adenylyl cyclase activation assay
J Med Chem 52: 5330-43 (2009)
Article DOI: 10.1021/jm900881j
BindingDB Entry DOI: 10.7270/Q2CF9RBH