BDBM50414730 CHEMBL553404
SMILES: [H][C@]12CC[C@]([H])(C[C@@H](C1)NC(=O)c1cc3ccccc3n(C(C)C)c1=O)N2CCCCCCCN(C)CCCN(C)S(C)(=O)=O
InChI Key: InChIKey=OZOUMOAFNFHRMX-PKQPGRETSA-N
Data: 1 KI  1 EC50
Activity Spreadsheet -- Enzyme Inhibition Constant Data from BindingDB
Found 2 hits for monomerid = 50414730
Trg + Lig
Ki
nM
ΔG°
kcal/mole
IC50
nM
Kd
nM
EC50/IC50
nM
koff
s-1
kon
M-1s-1
pHTemp
°C
5-hydroxytryptamine receptor 4 (5-HT4)
(Homo sapiens (Human))
BDBM50414730
(CHEMBL553404)
Show SMILES [H][C@]12CC[C@]([H])(C[C@@H](C1)NC(=O)c1cc3ccccc3n(C(C)C)c1=O)N2CCCCCCCN(C)CCCN(C)S(C)(=O)=O |r|
Show InChI InChI=1S/C33H53N5O4S/c1-25(2)38-31-15-10-9-14-26(31)22-30(33(38)40)32(39)34-27-23-28-16-17-29(24-27)37(28)21-12-8-6-7-11-18-35(3)19-13-20-36(4)43(5,41)42/h9-10,14-15,22,25,27-29H,6-8,11-13,16-21,23-24H2,1-5H3,(H,34,39)/t27-,28+,29-
5.01n/an/an/an/an/an/an/an/a
Theravance, Inc.
Curated by ChEMBL
Assay Description
Displacement of [H]GR-113808 from human 5HT4C receptor expressed in HEK293 cells by liquid scintillation counting
J Med Chem 52: 5330-43 (2009)
Article DOI: 10.1021/jm900881j
BindingDB Entry DOI: 10.7270/Q2CF9RBH
5-hydroxytryptamine receptor 4 (5-HT4)
(Homo sapiens (Human))
BDBM50414730
(CHEMBL553404)
Show SMILES [H][C@]12CC[C@]([H])(C[C@@H](C1)NC(=O)c1cc3ccccc3n(C(C)C)c1=O)N2CCCCCCCN(C)CCCN(C)S(C)(=O)=O |r|
Show InChI InChI=1S/C33H53N5O4S/c1-25(2)38-31-15-10-9-14-26(31)22-30(33(38)40)32(39)34-27-23-28-16-17-29(24-27)37(28)21-12-8-6-7-11-18-35(3)19-13-20-36(4)43(5,41)42/h9-10,14-15,22,25,27-29H,6-8,11-13,16-21,23-24H2,1-5H3,(H,34,39)/t27-,28+,29-
n/an/an/an/a 0.631n/an/an/an/a
Theravance, Inc.
Curated by ChEMBL
Assay Description
Agonist activity at human 5HT4C receptor expressed in HEK293 cells assessed as acumulation of cAMP by flash plate adenylyl cyclase activation assay
J Med Chem 52: 5330-43 (2009)
Article DOI: 10.1021/jm900881j
BindingDB Entry DOI: 10.7270/Q2CF9RBH