BDBM50414777 CHEMBL574731
SMILES: CN(C)CCC(NC(=O)c1cccc(c1)-c1ccc(Cl)cc1)c1ccc(C)cc1
InChI Key: InChIKey=LVSUEMWSTVOYOI-UHFFFAOYSA-N
Data: 1 EC50
Activity Spreadsheet -- Enzyme Inhibition Constant Data from BindingDB
Found 1 hit for monomerid = 50414777
Trg + Lig
Ki
nM
ΔG°
kcal/mole
IC50
nM
Kd
nM
EC50/IC50
nM
koff
s-1
kon
M-1s-1
pHTemp
°C
Urotensin-2
(Homo sapiens (Human))
BDBM50414777
(CHEMBL574731)
Show SMILES CN(C)CCC(NC(=O)c1cccc(c1)-c1ccc(Cl)cc1)c1ccc(C)cc1
Show InChI InChI=1S/C25H27ClN2O/c1-18-7-9-20(10-8-18)24(15-16-28(2)3)27-25(29)22-6-4-5-21(17-22)19-11-13-23(26)14-12-19/h4-14,17,24H,15-16H2,1-3H3,(H,27,29)
Reactome pathway
n/an/an/an/a 646n/an/an/an/a
University of Gothenburg
Curated by ChEMBL
Assay Description
Agonist activity against human urotensin 2 receptor expressed in human NIH373 cells assessed as beta-galactosidase activity after 5 days by R-SAT ass...
Bioorg Med Chem 17: 4657-65 (2009)
Article DOI: 10.1016/j.bmc.2009.04.062
BindingDB Entry DOI: 10.7270/Q20866J9