BDBM50414872 CHEMBL574010
SMILES: COc1cc2Cc3c(NCc4ccc(Cl)cc4)[nH]nc3-c2cc1OC
InChI Key: InChIKey=HNLHGHBNWZKUBS-UHFFFAOYSA-N
Data: 1 IC50
Activity Spreadsheet -- Enzyme Inhibition Constant Data from BindingDB
Found 1 hit for monomerid = 50414872
Trg + Lig
Ki
nM
ΔG°
kcal/mole
IC50
nM
Kd
nM
EC50/IC50
nM
koff
s-1
kon
M-1s-1
pHTemp
°C
Eukaryotic translation initiation factor 2-alpha kinase 1
(Homo sapiens (Human))
BDBM50414872
(CHEMBL574010)
Show SMILES COc1cc2Cc3c(NCc4ccc(Cl)cc4)[nH]nc3-c2cc1OC
Show InChI InChI=1S/C19H18ClN3O2/c1-24-16-8-12-7-15-18(14(12)9-17(16)25-2)22-23-19(15)21-10-11-3-5-13(20)6-4-11/h3-6,8-9H,7,10H2,1-2H3,(H2,21,22,23)
n/an/a 2.51E+3n/an/an/an/an/an/a
Johnson& Johnson Pharmaceutical Research and Development
Curated by ChEMBL
Assay Description
Inhibition of human HRI kinase
Bioorg Med Chem Lett 19: 6548-51 (2009)
Article DOI: 10.1016/j.bmcl.2009.10.033
BindingDB Entry DOI: 10.7270/Q26Q1ZGZ