BDBM50415046 CHEMBL583658
SMILES: Cc1cccc(n1)C(=O)N[C@H]1C[C@H](C1)n1cnc(NC(=O)Cc2cccc3ccccc23)c1
InChI Key: InChIKey=WESLFWSZUGLONY-OYRHEFFESA-N
Data: 2 IC50
Activity Spreadsheet -- Enzyme Inhibition Constant Data from BindingDB
Found 2 hits for monomerid = 50415046
Trg + Lig
Ki
nM
ΔG°
kcal/mole
IC50
nM
Kd
nM
EC50/IC50
nM
koff
s-1
kon
M-1s-1
pHTemp
°C
Cyclin-Dependent Kinase 5 (CDK5)
(Homo sapiens (Human))
BDBM50415046
(CHEMBL583658)
Show SMILES Cc1cccc(n1)C(=O)N[C@H]1C[C@H](C1)n1cnc(NC(=O)Cc2cccc3ccccc23)c1 |r,wU:10.10,12.15,(14.65,-10.99,;14.63,-9.45,;13.28,-8.7,;13.27,-7.16,;14.59,-6.38,;15.92,-7.14,;15.95,-8.67,;17.25,-6.35,;17.24,-4.81,;18.59,-7.11,;19.92,-6.33,;20.6,-4.95,;21.99,-5.63,;21.3,-7.01,;23.45,-5.14,;23.91,-3.67,;25.45,-3.66,;25.94,-5.12,;27.27,-5.89,;27.27,-7.43,;25.93,-8.2,;28.6,-8.21,;28.59,-9.75,;29.92,-10.51,;29.92,-12.05,;28.58,-12.82,;27.25,-12.05,;25.93,-12.81,;24.6,-12.05,;24.6,-10.51,;25.93,-9.74,;27.25,-10.51,;24.7,-6.03,)|
Show InChI InChI=1S/C26H25N5O2/c1-17-6-4-11-23(28-17)26(33)29-20-13-21(14-20)31-15-24(27-16-31)30-25(32)12-19-9-5-8-18-7-2-3-10-22(18)19/h2-11,15-16,20-21H,12-14H2,1H3,(H,29,33)(H,30,32)/t20-,21+
NCI pathway
Reactome pathway
n/an/a 230n/an/an/an/an/an/a
Pfizer Inc.
Curated by ChEMBL
Assay Description
Inhibition of human CDK5/p25 expressed in CHO cells after 2 hrs by whole cell assay
Bioorg Med Chem Lett 19: 5703-7 (2009)
Article DOI: 10.1016/j.bmcl.2009.08.019
BindingDB Entry DOI: 10.7270/Q29G5P29
Cyclin-Dependent Kinase 5 (CDK5)
(Homo sapiens (Human))
BDBM50415046
(CHEMBL583658)
Show SMILES Cc1cccc(n1)C(=O)N[C@H]1C[C@H](C1)n1cnc(NC(=O)Cc2cccc3ccccc23)c1 |r,wU:10.10,12.15,(14.65,-10.99,;14.63,-9.45,;13.28,-8.7,;13.27,-7.16,;14.59,-6.38,;15.92,-7.14,;15.95,-8.67,;17.25,-6.35,;17.24,-4.81,;18.59,-7.11,;19.92,-6.33,;20.6,-4.95,;21.99,-5.63,;21.3,-7.01,;23.45,-5.14,;23.91,-3.67,;25.45,-3.66,;25.94,-5.12,;27.27,-5.89,;27.27,-7.43,;25.93,-8.2,;28.6,-8.21,;28.59,-9.75,;29.92,-10.51,;29.92,-12.05,;28.58,-12.82,;27.25,-12.05,;25.93,-12.81,;24.6,-12.05,;24.6,-10.51,;25.93,-9.74,;27.25,-10.51,;24.7,-6.03,)|
Show InChI InChI=1S/C26H25N5O2/c1-17-6-4-11-23(28-17)26(33)29-20-13-21(14-20)31-15-24(27-16-31)30-25(32)12-19-9-5-8-18-7-2-3-10-22(18)19/h2-11,15-16,20-21H,12-14H2,1H3,(H,29,33)(H,30,32)/t20-,21+
NCI pathway
Reactome pathway
n/an/a 6n/an/an/an/an/an/a
Pfizer Inc.
Curated by ChEMBL
Assay Description
Inhibition of CDK5/p25 by scintillation proximity assay
Bioorg Med Chem Lett 19: 5703-7 (2009)
Article DOI: 10.1016/j.bmcl.2009.08.019
BindingDB Entry DOI: 10.7270/Q29G5P29